Index of pkgsrc-bugs for June, 2013


FromSubject
06/01/2013
Re: pkg/47865 (devel/rcs fails to compile on Solaris)
Ryo ONODERAPR/47865 CVS commit: pkgsrc/devel/rcs
Re: pkg/47865 (devel/rcs fails to compile on Solaris)
pkg/47873: "rtorrent" package can no longer be built with GCC 4.1.2
Re: pkg/47873 ("rtorrent" package can no longer be built with GCC 4.1.2)
pkg/47874: devel/meld can't link because it's missing -lf95
pkg/47875: graphviz won't build on Mac OS X, and doesn't support quartz
pkg/47876: devel/doxygen won't build on Mac OS X because compiler doesn't understand "-Wno-invalid-source-encoding"
Ryo ONODERAPR/47734 CVS commit: pkgsrc/www/firefox17
Re: pkg/26003 (piewm not respecting/using GNU_PROGRAM_PREFIX (patch included))
Joerg SonnenbergerRe: pkg/47876: devel/doxygen won't build on Mac OS X because compiler doesn't understand "-Wno-invalid-source-encoding"
Re: pkg/47060 (pkgin is sometimes too terse and operator-unfriendly)
Joerg SonnenbergerRe: pkg/47876: devel/doxygen won't build on Mac OS X because compiler doesn't understand "-Wno-invalid-source-encoding"
David HollandRe: pkg/47206 (build problems with xulrunner 16.0.2: : 'malloc_usable_size' was not declared in this scope)
Re: pkg/47460 (lang/gcc47 gets undefined reference to `__sync_bool_compare_and_swap_4')
Re: pkg/47530 (devel/xulrunner gcc45-4.5.3nb4 is not available for DragonFly-3.3-x86_64)
David HollandRe: pkg/28946
Re: pkg/34215 (games/grhino)
David HollandRe: pkg/47711: net/mtr asn lookup (z option)
Re: pkg/47751 (apr-util-1.4.1nb5 build fails because of libtool error)
David HollandRe: pkg/47822: x11/modular-xorg-server 1.12.4 DragonFly x86_64 xf86_OSlib.h:284:27: fatal error: machine/mouse.h
David HollandRe: pkg/47854: netatalk 3.0.4 from sourceforge does not build on NetBSD 6.0.x
David HollandRe: pkg/47828: sysutils/libpciaccess 0.13.1 incompatible with xorg-server 1.12.4?
Re: pkg/45265 (visibility in graphics/MesaLib still broken with GCC 4.6 on Solaris)
David HollandRe: pkg/45265 (visibility in graphics/MesaLib still broken with GCC 4.6 on Solaris)
06/02/2013
Re: pkg/24731 (bootstrap-pkgsrc on cygwin (patch))
Re: pkg/24731 (bootstrap-pkgsrc on cygwin (patch))
David HollandRe: pkg/46983: openoffice3 fails to start properly
Ryo ONODERAPR/47734 CVS commit: pkgsrc/www/firefox
Re: pkg/47734 (www/firefox17 install: /usr/pkgsrc/www/firefox17/work/.destdir/usr/pkg/bin/firefox17: No such file)
Re: pkg/47734 (www/firefox17 install: /usr/pkgsrc/www/firefox17/work/.destdir/usr/pkg/bin/firefox17: No such file)
Ryo ONODERARe: pkg/45663
Ryo ONODERARe: pkg/47872: graphics/gimp-help-XX are out of date
Matthias SchelerPR/47873 CVS commit: pkgsrc/net
Re: pkg/47873 ("rtorrent" package can no longer be built with GCC 4.1.2)
06/03/2013
=?ISO-8859-1?Q?J=F6rn_Clausen?=Re: pkg/45265 (visibility in graphics/MesaLib still broken with GCC 4.6 on Solaris)
=?ISO-8859-1?Q?J=F6rn_Clausen?=Re: pkg/45265 (visibility in graphics/MesaLib still broken with GCC 4.6 on Solaris)
pkg/47882: "gtk2+" package doesn't build under NetBSD 6.1
Re: pkg/47882 ("gtk2+" package doesn't build under NetBSD 6.1)
Thomas KlausnerRe: pkg/47882 ("gtk2+" package doesn't build under NetBSD 6.1)
Matthias SchelerRe: pkg/47882 ("gtk2+" package doesn't build under NetBSD 6.1)
Re: pkg/47882 ("gtk2+" package doesn't build under NetBSD 6.1)
Thomas KlausnerPR/47882 CVS commit: pkgsrc
Izumi Tsutsuipkg/47883: efont-unicode-0.4.2nb1.tgz binary on ftp.NetBSD.org is broken
Matthias SchelerRe: pkg/47882 ("gtk2+" package doesn't build under NetBSD 6.1)
Matthias SchelerRe: pkg/47882 ("gtk2+" package doesn't build under NetBSD 6.1)
David ShaoRe: PR/47734 CVS commit: pkgsrc/www/firefox
Thomas KlausnerRe: pkg/47882 ("gtk2+" package doesn't build under NetBSD 6.1)
David HollandRe: pkg/47882 ("gtk2+" package doesn't build under NetBSD 6.1)
Re: pkg/47882 ("gtk2+" package doesn't build under NetBSD 6.1)
Re: pkg/47734 (www/firefox17 install: /usr/pkgsrc/www/firefox17/work/.destdir/usr/pkg/bin/firefox17: No such file)
Matthias SchelerRe: pkg/47882 ("gtk2+" package doesn't build under NetBSD 6.1)
Re: pkg/47882 ("gtk2+" package doesn't build under NetBSD 6.1)
Matthias SchelerRe: pkg/47882 ("gtk2+" package doesn't build under NetBSD 6.1)
David HollandRe: pkg/47882 ("gtk2+" package doesn't build under NetBSD 6.1)
David HollandRe: pkg/47882 ("gtk2+" package doesn't build under NetBSD 6.1)
David HollandRe: pkg/47882 ("gtk2+" package doesn't build under NetBSD 6.1)
David HollandRe: pkg/47882 ("gtk2+" package doesn't build under NetBSD 6.1)
06/04/2013
OBATA AkioRe: pkg/47882 ("gtk2+" package doesn't build under NetBSD 6.1)
Matthias SchelerRe: pkg/47882 ("gtk2+" package doesn't build under NetBSD 6.1)
Matthias SchelerRe: pkg/47882 ("gtk2+" package doesn't build under NetBSD 6.1)
Thomas KlausnerRe: pkg/47882 ("gtk2+" package doesn't build under NetBSD 6.1)
=?ISO-8859-1?Q?J=F6rn_Clausen?=Re: pkg/47865 (devel/rcs fails to compile on Solaris)
=?ISO-8859-1?Q?J=F6rn_Clausen?=Re: pkg/47865 (devel/rcs fails to compile on Solaris)
Re: pkg/47865 (devel/rcs fails to compile on Solaris)
Re: pkg/47882
Re: pkg/47882 ("gtk2+" package doesn't build under NetBSD 6.1)
Re: pkg/47882 ("gtk2+" package doesn't build under NetBSD 6.1)
Matthias SchelerRe: pkg/47882
Matthias SchelerRe: pkg/47882
Re: pkg/47882 ("gtk2+" package doesn't build under NetBSD 6.1)
Matthias SchelerPR/47882 CVS commit: pkgsrc/pkgtools/x11-links
Matthias SchelerPR/47882 CVS commit: pkgsrc/graphics/freetype2
pkg/47887: sysutils/rsnapshot does not build with perl 5.18
Re: pkg/47887 (sysutils/rsnapshot does not build with perl 5.18)
Thomas KlausnerPR/47887 CVS commit: pkgsrc/sysutils/rsnapshot
David HollandRe: pkg/47882 ("gtk2+" package doesn't build under NetBSD 6.1)
Matthias SchelerPR/47882 CVS commit: pkgsrc
Ryo ONODERARe: pkg/47882
06/05/2013
pkg/47889: update misc/vimpager to 1.8.2
David HollandRe: pkg/47889: update misc/vimpager to 1.8.2
pkg/47891: www/firefox 21.0nb4 Python platform dragonfly3 is not supported
=?UTF-8?B?RnLDqWTDqXJpYyBGYXViZXJ0ZWF1?=Re: pkg/47751
Re: pkg/47891 (www/firefox 21.0nb4 Python platform dragonfly3 is not supported)
Thomas KlausnerRe: pkg/47751
=?ISO-8859-1?Q?J=F6rn_Clausen?=Re: pkg/47867: graphics/openexr does not compile on Solaris 10
Matthias SchelerPR/47882 CVS commit: pkgsrc/x11/libXft
NONAKA KimihiroRe: pkg/47889: update misc/vimpager to 1.8.2
NONAKA KimihiroRe: pkg/47889: update misc/vimpager to 1.8.2
Hauke FathRe: pkg/47854: netatalk 3.0.4 from sourceforge does not build on NetBSD 6.0.x
Andreas Gustafssonpkg/47895: py27-matplotlib binary package can't find libfreetype.so.7
Thomas KlausnerRe: pkg/47895: py27-matplotlib binary package can't find libfreetype.so.7
=?UTF-8?B?RnLDqWTDqXJpYyBGYXViZXJ0ZWF1?=Re: pkg/47751
Andreas GustafssonRe: pkg/47895: py27-matplotlib binary package can't find libfreetype.so.7
Re: pkg/47895 (py27-matplotlib binary package can't find libfreetype.so.7)
pkg/47897: pkgsrc/net/pppd: ARP interface is outdated
pkg/47898: pkgsrc request: xl2tpd
Thomas Klausnerpkg/47900: vlc2 doesn't build on NetBSD-6.99.20/amd64
Re: pkg/47900 (vlc2 doesn't build on NetBSD-6.99.20/amd64)
David ShaoRe: pkg/47891: www/firefox 21.0nb4 Python platform dragonfly3 is not supported
06/06/2013
OBATA AkioPR/47883 CVS commit: pkgsrc/mk/tools
Re: pkg/24731 (bootstrap-pkgsrc on cygwin (patch))
David HollandRe: pkg/24731 (bootstrap-pkgsrc on cygwin (patch))
Re: pkg/47898 (pkgsrc request: xl2tpd)
Hauke FathPR/47898 CVS commit: pkgsrc/doc
Hauke FathRe: pkg/47889: update misc/vimpager to 1.8.2
OBATA AkioPR/47889 CVS commit: pkgsrc/misc/vimpager
Re: pkg/47889 (update misc/vimpager to 1.8.2)
pkg/47901: [PATCH] editors/emacs-snapshot 20130603
Re: pkg/47882 ("gtk2+" package doesn't build under NetBSD 6.1)
pkg/47902: samba (nmbd) needs libexecinfo
06/07/2013
OBATA AkioRe: pkg/47902: samba (nmbd) needs libexecinfo
Makoto FujiwaraRe: pkg/47902: samba (nmbd) needs libexecinfo
pkg/47903: bootstrap bmake: configure: WARNING: cache variable ac_cv_host contains a newline
Richard PALORe: pkg/47903: bootstrap bmake: configure: WARNING: cache variable ac_cv_host contains a newline
pkg/47905: misc/vimpager: wrong DEPENDS for vim-gtk2
Re: pkg/47905 (misc/vimpager: wrong DEPENDS for vim-gtk2)
pkg/47906: lang/g95: SEGV occurs when stack address is not aligned 8 bytes at main().
Matthias SchelerPR/47848 CVS commit: [pkgsrc-2013Q1] pkgsrc/devel/transifex-client
pkg/47908: OpenSSL SSL connection fails with unaligned access error with SHA256
Richard PALORe: pkg/47903: bootstrap bmake: configure: WARNING: cache variable ac_cv_host contains a newline
Christos ZoulasPR/47908 CVS commit: src/common/lib/libc/hash/sha2
06/08/2013
Re: pkg/47903 (bootstrap bmake: configure: WARNING: cache variable ac_cv_host contains a newline)
Re: pkg/47906 (lang/g95: SEGV occurs when stack address is not aligned 8 bytes at main().)
Re: pkg/47901 (emacs-snapshot-20130603)
Joerg SonnenbergerRe: pkg/47906: lang/g95: SEGV occurs when stack address is not aligned 8 bytes at main().
06/09/2013
OBATA AkioPR/47883 CVS commit: pkgsrc/fonts
Re: pkg/47883 (efont-unicode-0.4.2nb1.tgz binary on ftp.NetBSD.org is broken)
Matthias SchelerPR/47883 CVS commit: [pkgsrc-2013Q1] pkgsrc
06/10/2013
pkg/47913: graphics/MesaLib #error Unknown Endianness (PowerPC)
Re: pkg/47913 (#error Unknown Endianness (PowerPC))
pkg/47914: archivers/gzip does not compile on NetBSD
Re: pkg/47914 (archivers/gzip does not compile on NetBSD)
Ryo ONODERAPR/47914 CVS commit: pkgsrc/archivers/gzip
=?ISO-8859-1?Q?J=F6rn_Clausen?=Re: PR/47914 CVS commit: pkgsrc/archivers/gzip
=?ISO-8859-1?Q?J=F6rn_Clausen?=Re: PR/47914 CVS commit: pkgsrc/archivers/gzip
Makoto FujiwaraPR/47913 CVS commit: pkgsrc/graphics/MesaLib
Re: pkg/47913 (#error Unknown Endianness (PowerPC))
Re: pkg/47914 (archivers/gzip does not compile on NetBSD)
06/11/2013
Re: pkg/47883 (efont-unicode-0.4.2nb1.tgz binary on ftp.NetBSD.org is broken)
Edgar =?iso-8859-1?B?RnXf?=Re: pkg/47787
Izumi TsutsuiRe: PR/47883 CVS commit: pkgsrc/mk/tools
Re: pkg/47787 (www/squid3's LDAP helpers don't build on a system with non-native LDAP)
David HollandRe: pkg/47903: bootstrap bmake: configure: WARNING: cache variable ac_cv_host contains a newline
pkg/47917: shells/posh segmentation faults
Re: pkg/47917 (shells/posh segmentation faults)
Makoto FujiwaraPR/47917 CVS commit: pkgsrc/shells/posh
Re: pkg/47917 (shells/posh segmentation faults)
06/12/2013
pkg/47919: graphics/MesaLib does not compile on Solaris/sparc
Thomas KlausnerRe: pkg/47828: sysutils/libpciaccess 0.13.1 incompatible with xorg-server 1.12.4?
David ShaoRe: pkg/47828: sysutils/libpciaccess 0.13.1 incompatible with xorg-server 1.12.4?
Thomas KlausnerRe: pkg/47828: sysutils/libpciaccess 0.13.1 incompatible with xorg-server 1.12.4?
David ShaoRe: pkg/47828: sysutils/libpciaccess 0.13.1 incompatible with xorg-server 1.12.4?
Thomas KlausnerRe: pkg/47828: sysutils/libpciaccess 0.13.1 incompatible with xorg-server 1.12.4?
Taylor R CampbellPR/47838 CVS commit: pkgsrc/mk/tools
Re: pkg/47838 (PYTHON_FOR_BUILD_ONLY= tool can cause problems build openssl dependency for python)
06/13/2013
Nat SlossRe: pkg/46565
pkg/47924: lang/perl5 5.18.0 regressions on NetBSD/i386
06/14/2013
Re: pkg/47903 (bootstrap bmake: configure: WARNING: cache variable ac_cv_host contains a newline)
David HollandRe: pkg/47901: [PATCH] editors/emacs-snapshot 20130603
csosstudy E.Subject: Re: pkg/47140
Re: pkg/47140 (NetBSD Problem Report #47137 repair(dnscrypt-proxy 1.2.0))
Re: pkg/47234 (misc/dpkg 1.16.3nb2 compilation failure and Mistake PLIST entry for PerlModule and Update 1.16.9)
pkg/47926: Perl 5.18.0 requieres modification of spamassassin 3.3.2
pkg/47927: Update misc/howm to 1.4.1
pkg/47928: small small mk/defualts/mk.conf update & cleanup
Re: pkg/47928 (small small mk/defualts/mk.conf update & cleanup)
Thomas KlausnerPR/47928 CVS commit: pkgsrc/mk/defaults
06/15/2013
Re: pkg/47249 (sysutils/cfengine3 upgrade)
Re: pkg/45818 (Sid-milter package has different problems)
Fredrik PettaiRe: pkg/47843 (update mail/opendkim to latest version (2.8.3))
Fredrik PettaiRe: pkg/47843 (update mail/opendkim to latest version (2.8.3))
Re: pkg/47843 (update mail/opendkim to latest version (2.8.3))
Thomas KlausnerPR/47900 CVS commit: pkgsrc/multimedia/vlc2
06/16/2013
pkg/47932: devel/glib2 on NetBSD 6.99.21 gfileutils.c:1022:9: error: #pragma GCC diagnostic not allowed inside functions
pkg/47933: make configure in pkgsrc/audio/nas fails
David HollandRe: pkg/47933: make configure in pkgsrc/audio/nas fails
Ryo ONODERARe: pkg/47933: make configure in pkgsrc/audio/nas fails
David HollandRe: pkg/47933: make configure in pkgsrc/audio/nas fails
OBATA AkioPR/47919 CVS commit: pkgsrc/graphics/MesaLib
Ryo ONODERARe: pkg/47933: make configure in pkgsrc/audio/nas fails
Ryo ONODERARe: pkg/47933: make configure in pkgsrc/audio/nas fails
Izumi Tsutsuipkg/47934: pkgsrc/devel/glib2 build failure with gcc
Re: pkg/47934 (pkgsrc/devel/glib2 build failure with gcc)
Re: pkg/47932 (devel/glib2 on NetBSD 6.99.21 gfileutils.c:1022:9: error: #pragma GCC diagnostic not allowed inside functions)
pkg/47935: x11/xf86-video-ati doesn't work
Re: pkg/47919 (graphics/MesaLib does not compile on Solaris/sparc)
Joerg SonnenbergerRe: pkg/47932 (devel/glib2 on NetBSD 6.99.21 gfileutils.c:1022:9: error: #pragma GCC diagnostic not allowed inside functions)
pkg/47936: thumbpdf does not work
Thomas KlausnerPR/47934 CVS commit: pkgsrc/devel/glib2
Thomas KlausnerPR/47932 CVS commit: pkgsrc/devel/glib2
06/17/2013
pkg/47938: editors/emacs 24.3 DragonFly 3.5 xdisp.c expected specifier-qualifier-list before 'typedef'
David ShaoRe: pkg/47932: devel/glib2 on NetBSD 6.99.21 gfileutils.c:1022:9: error: #pragma GCC diagnostic not allowed inside functions
Re: pkg/47932 (devel/glib2 on NetBSD 6.99.21 gfileutils.c:1022:9: error: #pragma GCC diagnostic not allowed inside functions)
OBATA AkioPR/47234 CVS commit: pkgsrc/misc/dpkg
Re: pkg/47924 (lang/perl5 5.18.0 regressions on NetBSD/i386)
06/18/2013
Re: pkg/47935 (x11/xf86-video-ati doesn't work)
Thomas KlausnerPR/47935 CVS commit: pkgsrc/x11/xf86-video-ati6
Izumi TsutsuiRe: pkg/47932
Joerg SonnenbergerRe: pkg/47932
Izumi Tsutsuipkg/47941: devel/glib2 build failure on NetBSD/arm 6.1
Thomas KlausnerPR/47935 CVS commit: pkgsrc/x11/xf86-video-ati6
pkg/47942: lang/python27 (2.7.5) and lang/python26 (2.6.8nb3) dump core when generating gimp-2.8's document
Stefan SchaeckelerRe: pkg/47936: thumbpdf does not work
06/19/2013
pkg/47943: recent update to libpcap breaks tcpdump, nmap and wireshark on Solaris
Re: pkg/47943 (recent update to libpcap breaks tcpdump, nmap and wireshark on Solaris)
Izumi TsutsuiRe: pkg/47941: devel/glib2 build failure on NetBSD/arm 6.1
Joerg SonnenbergerRe: pkg/47941: devel/glib2 build failure on NetBSD/arm 6.1
Izumi TsutsuiRe: pkg/47941: devel/glib2 build failure on NetBSD/arm 6.1
Izumi TsutsuiRe: pkg/47941: devel/glib2 build failure on NetBSD/arm 6.1
06/20/2013
=?UTF-8?Q?Fr=C3=A9d=C3=A9ric_Fauberteau?=Re: pkg/47751 (apr-util-1.4.1nb5 build fails because of libtool error)
Re: pkg/47751 (apr-util-1.4.1nb5 build fails because of libtool error)
pkg/47944: installation of lang/mono2 fails on Solaris 10
Re: pkg/47944 (installation of lang/mono2 fails on Solaris 10)
Re: pkg/47943 (recent update to libpcap breaks tcpdump, nmap and wireshark on Solaris)
Izumi TsutsuiRe: pkg/47941: devel/glib2 build failure on NetBSD/arm 6.1
Alistair CrooksRe: pkg/47941: devel/glib2 build failure on NetBSD/arm 6.1
Alistair CrooksRe: pkg/47941: devel/glib2 build failure on NetBSD/arm 6.1
Re: pkg/47845 (fail to install xulrunner-19.0.2nb1.tgz netbsd 6.1 amd64 wrong checksum)
pkg/47946: x11/enlightenment patches for DragonFly 3.5 x86_64
06/21/2013
=?ISO-8859-1?Q?J=F6rn_Clausen?=Re: pkg/47943 (recent update to libpcap breaks tcpdump, nmap and wireshark on Solaris)
=?ISO-8859-1?Q?J=F6rn_Clausen?=Re: pkg/47943 (recent update to libpcap breaks tcpdump, nmap and wireshark on Solaris)
=?ISO-8859-1?Q?J=F6rn_Clausen?=Re: pkg/47943 (recent update to libpcap breaks tcpdump, nmap and wireshark on Solaris)
=?ISO-8859-1?Q?J=F6rn_Clausen?=Re: pkg/47943 (recent update to libpcap breaks tcpdump, nmap and wireshark on Solaris)
Jonathan PerkinRe: pkg/47943 (recent update to libpcap breaks tcpdump, nmap and wireshark on Solaris)
Jonathan PerkinRe: pkg/47943 (recent update to libpcap breaks tcpdump, nmap and wireshark on Solaris)
=?iso-8859-2?Q?Adam_Ciarci=F1ski?=Re: pkg/47943 (recent update to libpcap breaks tcpdump, nmap and wireshark on Solaris)
=?iso-8859-2?Q?Adam_Ciarci=F1ski?=Re: pkg/47943 (recent update to libpcap breaks tcpdump, nmap and wireshark on Solaris)
=?UTF-8?B?SsO2cm4gQ2xhdXNlbg==?=Re: pkg/47943 (recent update to libpcap breaks tcpdump, nmap and wireshark on Solaris)
=?UTF-8?B?SsO2cm4gQ2xhdXNlbg==?=Re: pkg/47943 (recent update to libpcap breaks tcpdump, nmap and wireshark on Solaris)
=?ISO-8859-1?Q?J=F6rn_Clausen?=Re: pkg/47943 (recent update to libpcap breaks tcpdump, nmap and wireshark on Solaris)
=?ISO-8859-1?Q?J=F6rn_Clausen?=Re: pkg/47943 (recent update to libpcap breaks tcpdump, nmap and wireshark on Solaris)
Tim ZingelmanRe: pkg/47943 (recent update to libpcap breaks tcpdump, nmap and wireshark on Solaris)
Tim ZingelmanRe: pkg/47943 (recent update to libpcap breaks tcpdump, nmap and wireshark on Solaris)
Jonathan PerkinRe: pkg/47943 (recent update to libpcap breaks tcpdump, nmap and wireshark on Solaris)
Jonathan PerkinRe: pkg/47943 (recent update to libpcap breaks tcpdump, nmap and wireshark on Solaris)
pkg/47948: (x11/libdrm) [PATCH] powerpc support
=?UTF-8?B?SsO2cm4gQ2xhdXNlbg==?=Re: pkg/47943 (recent update to libpcap breaks tcpdump, nmap and wireshark on Solaris)
Jonathan PerkinRe: pkg/47943 (recent update to libpcap breaks tcpdump, nmap and wireshark on Solaris)
Jonathan PerkinRe: pkg/47943 (recent update to libpcap breaks tcpdump, nmap and wireshark on Solaris)
=?UTF-8?B?SsO2cm4gQ2xhdXNlbg==?=Re: pkg/47943 (recent update to libpcap breaks tcpdump, nmap and wireshark on Solaris)
Jonathan PerkinRe: pkg/47943 (recent update to libpcap breaks tcpdump, nmap and wireshark on Solaris)
pkg/47949: devel/ncurses fails to build on Darwin with a non-Xcode compiler
=?ISO-8859-1?Q?J=F6rn_Clausen?=support for older versions of Solaris (was: pkg/47943 ...)
=?ISO-8859-1?Q?J=F6rn_Clausen?=Re: pkg/47943 (recent update to libpcap breaks tcpdump, nmap and wireshark on Solaris)
Jonathan PerkinPR/47943 CVS commit: pkgsrc/net/libpcap
Jonathan PerkinPR/47946 CVS commit: pkgsrc/x11/enlightenment
pkg/47952: pkgsrc m17n-lib fails to build
06/22/2013
Makoto FujiwaraRe: pkg/47952: pkgsrc m17n-lib fails to build
Re: pkg/47952 (pkgsrc m17n-lib fails to build)
Re: pkg/47952 (pkgsrc m17n-lib fails to build)
Re: pkg/47949 (devel/ncurses fails to build on Darwin with a non-Xcode compiler)
Re: pkg/47949 (devel/ncurses fails to build on Darwin with a non-Xcode compiler)
OBATA AkioRe: pkg/47952: pkgsrc m17n-lib fails to build
David ShaoRe: pkg/47828: sysutils/libpciaccess 0.13.1 incompatible with xorg-server 1.12.4?
Re: pkg/47828 (sysutils/libpciaccess 0.13.1 incompatible with xorg-server 1.12.4?)
06/23/2013
Izumi TsutsuiPR/47941 CVS commit: pkgsrc/devel/glib2
Volkmar SeifertRe: pkg/47777 (nedit from pksrc editors/nedit crashes when saving default settings and on more occasions)
Volkmar SeifertRe: pkg/47777 (nedit from pksrc editors/nedit crashes when saving default settings and on more occasions)
OBATA AkioRe: pkg/47777 (nedit from pksrc editors/nedit crashes when saving default settings and on more occasions)
Marc BalmerRe: pkg/47777 (nedit from pksrc editors/nedit crashes when saving default settings and on more occasions)
Marc BalmerRe: pkg/47777 (nedit from pksrc editors/nedit crashes when saving default settings and on more occasions)
Marc BalmerRe: pkg/47777 (nedit from pksrc editors/nedit crashes when saving default settings and on more occasions)
Marc BalmerPR/47777 CVS commit: pkgsrc/editors/nedit
Marc BalmerRe: pkg/47777 (nedit from pksrc editors/nedit crashes when saving default settings and on more occasions)
Re: pkg/47777 (nedit from pksrc editors/nedit crashes when saving default settings and on more occasions)
Volkmar SeifertRe: pkg/47777 (nedit from pksrc editors/nedit crashes when saving default settings and on more occasions)
Volkmar SeifertRe: pkg/47777 (nedit from pksrc editors/nedit crashes when saving default settings and on more occasions)
Volkmar SeifertRe: pkg/47777 (nedit from pksrc editors/nedit crashes when saving default settings and on more occasions)
Volkmar SeifertRe: pkg/47777 (nedit from pksrc editors/nedit crashes when saving default settings and on more occasions)
Marc BalmerRe: pkg/47777 (nedit from pksrc editors/nedit crashes when saving default settings and on more occasions)
Marc BalmerRe: pkg/47777 (nedit from pksrc editors/nedit crashes when saving default settings and on more occasions)
Volkmar SeifertRe: pkg/47777 (nedit from pksrc editors/nedit crashes when saving default settings and on more occasions)
Volkmar SeifertRe: pkg/47777 (nedit from pksrc editors/nedit crashes when saving default settings and on more occasions)
Re: pkg/47777 (nedit from pksrc editors/nedit crashes when saving default settings and on more occasions)
Re: pkg/47753 (Hugin Compliation Errors on pkgsrc-2013Q1)
06/24/2013
Makoto FujiwaraRe: pkg/47938: editors/emacs 24.3 DragonFly 3.5 xdisp.c expected specifier-qualifier-list before 'typedef'
Makoto FujiwaraRe: pkg/47938: editors/emacs 24.3 DragonFly 3.5 xdisp.c expected specifier-qualifier-list before 'typedef'
06/25/2013
Tobias NygrenRe: PR/47935 CVS commit: pkgsrc/x11/xf86-video-ati6
06/26/2013
pkg/47964: devel/automoc4 NetBSD 6.99.22 amd64 native C compiler gcc" is not able to compile
Thomas KlausnerRe: pkg/47964: devel/automoc4 NetBSD 6.99.22 amd64 native C compiler gcc" is not able to compile
Izumi Tsutsuipkg/47965: pkgsrc/math/fftw build fails on NetBSD/arm 6.1
David ShaoRe: pkg/47964: devel/automoc4 NetBSD 6.99.22 amd64 native C compiler gcc" is not able to compile
pkg/47968: make replace does not replace packages in /usr/pkgsrc/packages/All
pkg/47969: ./pkgsrc/fonts/harfbuzz fails to build
06/27/2013
pkg/47970: pkgsrc/www/wordpress: swfupload-all.js disappeared in version 3.5.2
Re: pkg/47970 (pkgsrc/www/wordpress: swfupload-all.js disappeared in version 3.5.2)
Thomas KlausnerRe: pkg/47969: ./pkgsrc/fonts/harfbuzz fails to build
OBATA AkioRe: pkg/47968: make replace does not replace packages in /usr/pkgsrc/packages/All
Re: pkg/47970 (pkgsrc/www/wordpress: swfupload-all.js disappeared in version 3.5.2)
B HarderRe: pkg/47969: ./pkgsrc/fonts/harfbuzz fails to build
B HarderRe: pkg/47969: ./pkgsrc/fonts/harfbuzz fails to build
B HarderRe: pkg/47969: ./pkgsrc/fonts/harfbuzz fails to build
B HarderRe: pkg/47969: ./pkgsrc/fonts/harfbuzz fails to build
Thomas KlausnerRe: pkg/47969: ./pkgsrc/fonts/harfbuzz fails to build
B HarderRe: pkg/47969: ./pkgsrc/fonts/harfbuzz fails to build
B HarderRe: pkg/47969: ./pkgsrc/fonts/harfbuzz fails to build
B HarderRe: pkg/47969: ./pkgsrc/fonts/harfbuzz fails to build
06/29/2013
Re: pkg/47941 (devel/glib2 build failure on NetBSD/arm 6.1)
Re: pkg/46983 (openoffice3 fails to start properly)
Re: pkg/45018 (QEMU fails to build because of the i386 linker script)
Onno van der LindenRe: pkg/47132
Thomas Klausner" <PR/47132 CVS commit: pkgsrc/multimedia/ffmpeg
Re: pkg/47132 (MPlayer crashes (VLC is affected potentially too))
Thomas KlausnerPR/47132 CVS commit: pkgsrc/multimedia/mplayer-share
Thomas KlausnerRe: pkg/47964: devel/automoc4 NetBSD 6.99.22 amd64 native C compiler gcc" is not able to compile
Izumi TsutsuiPR/47965 CVS commit: pkgsrc/math/fftw
06/30/2013
Blue RatsPR/46914 CVS commit: pkgsrc/lang/Cg-compiler
Re: pkg/46914 (Please, pull up lang/Cg-compiler from wip/Cg-compiler)
Re: pkg/34108 (Wrong rpath order in BUILDLINK_LDFLAGS)
John D. BakerRe: pkg/47132: MPlayer crashes (VLC is affected potentially too)
Thomas KlausnerPR/47132 CVS commit: pkgsrc/multimedia/ffmpeg010
Thomas KlausnerRe: pkg/47132: MPlayer crashes (VLC is affected potentially too)
Re: pkg/47443 (Let's update the compiz packages!)