Index of pkgsrc-bugs for May, 2013


FromSubject
05/01/2013
Alistair CrooksRe: PR/47769 CVS commit: pkgsrc/textproc/ispell-ro
Alistair CrooksRe: PR/47769 CVS commit: pkgsrc/textproc/ispell-ro
Re: pkg/47767 (update security/libsodium to 0.4)
Alistair G. CrooksPR/47767 CVS commit: pkgsrc/security/libsodium
Timothy Lee RodenRe: PR/47769 CVS commit: pkgsrc/textproc/ispell-ro
Timothy Lee RodenRe: PR/47769 CVS commit: pkgsrc/textproc/ispell-ro
05/02/2013
David ShaoRe: pkg/47772: audio/pulseaudio 2.1nb3
Re: pkg/47777 (nedit from pksrc editors/nedit crashes when saving default settings and on more occasions)
Re: pkg/47784 (Typo in www/squid3/options.mk)
David HollandRe: PR/47769 CVS commit: pkgsrc/textproc/ispell-ro
Re: PR/47769 CVS commit: pkgsrc/textproc/ispell-ro
Re: PR/47769 CVS commit: pkgsrc/textproc/ispell-ro
David ShaoRe: pkg/47746: math/octave 3.6.4 and glpk 4.49
Izumi Tsutsuipkg/47791: New package: pkgsrc/net/ruby-tw, CUI Twitter client
pkg/47792: [PATCH] (devel/cmake) Fix wrong install PATH as /usr/local
David HollandRe: pkg/47792: [PATCH] (devel/cmake) Fix wrong install PATH as /usr/local
Makoto FujiwaraRe: pkg/47792: [PATCH] (devel/cmake) Fix wrong install PATH as /usr/local
05/03/2013
Re: pkg/47792 ([PATCH] (devel/cmake) Fix wrong install PATH as /usr/local)
OBATA AkioRe: pkg/47792: [PATCH] (devel/cmake) Fix wrong install PATH as /usr/local
Makoto FujiwaraPR/47792 CVS commit: pkgsrc/devel/cmake
Makoto FujiwaraPR/47792 CVS commit: pkgsrc/devel/cmake
Makoto FujiwaraRe: pkg/47791: New package: pkgsrc/net/ruby-tw, CUI Twitter client
Makoto FujiwaraRe: pkg/47657: editors/emacs-snapshot is now 20130304
Izumi TsutsuiRe: pkg/47791: New package: pkgsrc/net/ruby-tw, CUI Twitter client
Re: pkg/33850 (error in pkgsrc/devel/lincvs)
Re: pkg/45521 (Update editors/texmaker: 1.8 to 3.1)
Re: pkg/43459 (Out-of-date wm/wmii package in pkgsrc)
Re: pkg/42404 (openldap-server's slapd fails to start on Linux with the SASL option enabled in the package)
05/04/2013
Carlos MontiersNot bug, question about arc4.c
Min Sik KimPR/47657 CVS commit: pkgsrc/editors/emacs-snapshot
Re: pkg/47657 ((editors/emacs-snapshot) distfile was gone)
Makoto FujiwaraRe: pkg/47657 ((editors/emacs-snapshot) distfile was gone)
Makoto FujiwaraRe: pkg/47657 ((editors/emacs-snapshot) distfile was gone)
OBATA AkioPR/47784 CVS commit: pkgsrc/www/squid3
Re: pkg/47657 ((editors/emacs-snapshot) distfile was gone)
05/05/2013
Matthias SchelerPR/47784 CVS commit: [pkgsrc-2013Q1] pkgsrc/www/squid3
pkg/47797: lang/racket is missing libpng.so and also jpeg's one
Blue RatsPR/46910 CVS commit: pkgsrc/licenses
Re: pkg/46910 (Please, add SGI Free Software License B to pkgsrc/licenses)
Re: pkg/47797 (lang/racket is missing libpng.so and also jpeg's one)
Re: pkg/47387 (devel/exctags needs LICENSE and ${MKDIR} ${WRKSRC}/tmp in pre-configure)
Blue RatsPR/47387 CVS commit: pkgsrc/devel/exctags
05/06/2013
John D. BakerRe: pkg/47741: misc/openoffice3 build failure on NetBSD-5.2_STABLE/i386
05/07/2013
pkg/47800: update sysutils/logrotate to 3.8.4
Nils RatusznikRe: pkg/47800: update sysutils/logrotate to 3.8.4
pkg/47801: "gnome" pkg option broken in devel/xulrunner
pkg/47802: update mail/re-alpine to 2.03
Re: pkg/47800 (update sysutils/logrotate to 3.8.4)
Guillaume LasmayousPR/47800 CVS commit: pkgsrc/sysutils/logrotate
05/08/2013
pkg/47807: pkgsrc/py-libxml2 seems to have path problems in build
Thomas KlausnerRe: pkg/47807: pkgsrc/py-libxml2 seems to have path problems in build
Richard PALORe: pkg/47807: pkgsrc/py-libxml2 seems to have path problems in build
Richard PALORe: pkg/47807: pkgsrc/py-libxml2 seems to have path problems in build
Makoto FujiwaraRe: pkg/47791: New package: pkgsrc/net/ruby-tw, CUI Twitter client
Re: pkg/47808 (multimedia/kmix fails to build)
pkg/47808: multimedia/kmix fails to build
Thomas KlausnerRe: pkg/47791: New package: pkgsrc/net/ruby-tw, CUI Twitter client
05/09/2013
Makoto FujiwaraPR/47560 CVS commit: pkgsrc/net/lldpd
Re: pkg/47560 (lldpd package)
pkg/47811: graphics/ilmbase 2.0.0 asm/sigcontext.h: No such file or directory
Re: pkg/47811 (graphics/ilmbase 2.0.0 asm/sigcontext.h: No such file or directory)
Izumi TsutsuiRe: pkg/47791: New package: pkgsrc/net/ruby-tw, CUI Twitter client
Makoto FujiwaraPR/47791 CVS commit: pkgsrc
Re: pkg/47791 (New package: pkgsrc/net/ruby-tw, CUI Twitter client)
David ShaoRe: pkg/47811: graphics/ilmbase 2.0.0 asm/sigcontext.h: No such file or directory
05/10/2013
Re: pkg/47722 (devel/xulrunner DragonFly i386 no matching function for call to 'NS_MIN(int64_t&, __gnu_cxx::__enable_if::__type)')
05/11/2013
Re: pkg/44411 (lang/perl5 build failure on Linux/arm)
Makoto FujiwaraPR/47722 CVS commit: pkgsrc/devel/xulrunner
05/12/2013
Re: pkg/47722 (devel/xulrunner DragonFly i386 no matching function for call to 'NS_MIN(int64_t&, __gnu_cxx::__enable_if::__type)')
05/13/2013
David ShaoRe: pkg/47722 (devel/xulrunner DragonFly i386 no matching function for call to 'NS_MIN(int64_t&, __gnu_cxx::__enable_if::__type)')
Re: pkg/47722 (devel/xulrunner DragonFly i386 no matching function for call to 'NS_MIN(int64_t&, __gnu_cxx::__enable_if::__type)')
05/15/2013
Re: pkg/47807 (pkgsrc/py-libxml2 seems to have path problems in build)
Re: pkg/47802 (update mail/re-alpine to 2.03)
OBATA AkioRe: pkg/47787: www/squid3's LDAP helpers don't build on a system with non-native LDAP
Re: pkg/44611 (multimedia/libvdpau fails to build on SunOS [patch])
05/16/2013
Re: pkg/47323 (Please, pull up x11/xf86-video-nv to latest stable (2.1.20))
OBATA AkioPR/47787 CVS commit: pkgsrc/www/squid3
Re: pkg/47783 (math/metis fails to build with gcc 4.5.1)
OBATA AkioPR/47783 CVS commit: pkgsrc/math/metis
Re: pkg/47766 (www/squid3 does not contain digest_file_auth helper)
Re: pkg/47772 (audio/pulseaudio 2.1nb3)
Re: pkg/47758 (A libvirt security problem is seemingly solved)
Re: pkg/47758 (A libvirt security problem is seemingly solved)
Adam CiarcinskiPR/47761 CVS commit: pkgsrc/devel/pkg-config
Re: pkg/47758 (A libvirt security problem is seemingly solved)
Re: pkg/47761 (devel/pkg-config fails to build)
pkg/47820: x11/xf86-video-chips 1.2.5 /bin/cp /usr/pkgsrc/x11/xf86-video-chips/files/iopl.h
Re: pkg/47820 (x11/xf86-video-chips 1.2.5 /bin/cp /usr/pkgsrc/x11/xf86-video-chips/files/iopl.h)
Thomas KlausnerPR/47820 CVS commit: pkgsrc/x11/xf86-video-chips/files
05/17/2013
David ShaoRe: pkg/47820: x11/xf86-video-chips 1.2.5 /bin/cp /usr/pkgsrc/x11/xf86-video-chips/files/iopl.h
pkg/47821: graphics/MesaLib 7.11.2 DragonFly x86_64 mach64_context.h:302:22: fatal error: byteswap.h: No such file
pkg/47822: x11/modular-xorg-server 1.12.4 DragonFly x86_64 xf86_OSlib.h:284:27: fatal error: machine/mouse.h
Re: pkg/47820 (x11/xf86-video-chips 1.2.5 /bin/cp /usr/pkgsrc/x11/xf86-video-chips/files/iopl.h)
pkg/47824: GNAT Programming Studio terminates with unhandled exeption when attempting to build example code
pkg/47828: sysutils/libpciaccess 0.13.1 incompatible with xorg-server 1.12.4?
Richard PALORe: pkg/47828: sysutils/libpciaccess 0.13.1 incompatible with xorg-server 1.12.4?
Jukka Salmipkg/47829: mail/dkim-milter: missing RPATH when linking agains OpenSSL from pkgsrc
David ShaoRe: pkg/47828: sysutils/libpciaccess 0.13.1 incompatible with xorg-server 1.12.4?
05/18/2013
Re: pkg/46570
pkg/47831: lang/ruby193-base typo in patch-configure(.in) for DragonFly and FreeBSD
Re: pkg/47831 (lang/ruby193-base typo in patch-configure(.in) for DragonFly and FreeBSD)
pkg/47832: squid-3.3.4's basic_pam_auth segfaults with libgnumalloc
Re: pkg/47821 (graphics/MesaLib 7.11.2 DragonFly x86_64 mach64_context.h:302:22: fatal error: byteswap.h: No such file)
OBATA AkioPR/47821 CVS commit: pkgsrc/graphics/MesaLib/patches
OBATA AkioPR/47821 CVS commit: pkgsrc/graphics/MesaLib/patches
pkg/47833: PHP 5.3.25 w/ suhosin patch fails
Takahiro KambeRe: pkg/47833: PHP 5.3.25 w/ suhosin patch fails
Re: pkg/47833 (PHP 5.3.25 w/ suhosin patch fails)
Re: pkg/47824 (GNAT Programming Studio terminates with unhandled exeption when attempting to build example code)
Re: pkg/47829 (mail/dkim-milter: missing RPATH when linking agains OpenSSL from pkgsrc)
Re: pkg/47822 (x11/modular-xorg-server 1.12.4 DragonFly x86_64 xf86_OSlib.h:284:27: fatal error: machine/mouse.h)
Re: pkg/47831 (lang/ruby193-base typo in patch-configure(.in) for DragonFly and FreeBSD)
OBATA AkioPR/47822 CVS commit: pkgsrc/x11/modular-xorg-server
Volkmar SeifertRe: pkg/47833: PHP 5.3.25 w/ suhosin patch fails
Volkmar SeifertRe: pkg/47833 (PHP 5.3.25 w/ suhosin patch fails)
Takahiro KambeRe: pkg/47833: PHP 5.3.25 w/ suhosin patch fails
Volkmar SeifertRe: pkg/47833 (PHP 5.3.25 w/ suhosin patch fails)
Volkmar SeifertRe: pkg/47833: PHP 5.3.25 w/ suhosin patch fails
OBATA AkioRe: pkg/47820 (x11/xf86-video-chips 1.2.5 /bin/cp /usr/pkgsrc/x11/xf86-video-chips/files/iopl.h)
Re: pkg/38028 (New package: textproc/tcl-tdom)
Thomas KlausnerRe: pkg/47820 (x11/xf86-video-chips 1.2.5 /bin/cp /usr/pkgsrc/x11/xf86-video-chips/files/iopl.h)
Thomas KlausnerPR/47828 CVS commit: pkgsrc/sysutils/libpciaccess
Re: pkg/47828 (sysutils/libpciaccess 0.13.1 incompatible with xorg-server 1.12.4?)
Re: pkg/38027 (New package: x11/tk-tktable)
David ShaoRe: pkg/47831: lang/ruby193-base typo in patch-configure(.in) for DragonFly and FreeBSD
David ShaoRe: pkg/47821: graphics/MesaLib 7.11.2 DragonFly x86_64 mach64_context.h:302:22: fatal error: byteswap.h: No such file
David ShaoRe: pkg/47828: sysutils/libpciaccess 0.13.1 incompatible with xorg-server 1.12.4?
David ShaoRe: pkg/47822: x11/modular-xorg-server 1.12.4 DragonFly x86_64 xf86_OSlib.h:284:27: fatal error: machine/mouse.h
05/19/2013
OBATA AkioRe: pkg/47822: x11/modular-xorg-server 1.12.4 DragonFly x86_64 xf86_OSlib.h:284:27: fatal error: machine/mouse.h
OBATA AkioRe: pkg/47820 (x11/xf86-video-chips 1.2.5 /bin/cp /usr/pkgsrc/x11/xf86-video-chips/files/iopl.h)
Richard PALORe: pkg/47828: sysutils/libpciaccess 0.13.1 incompatible with xorg-server 1.12.4?
Re: pkg/47833 (PHP 5.3.25 w/ suhosin patch fails)
Re: pkg/47831 (lang/ruby193-base typo in patch-configure(.in) for DragonFly and FreeBSD)
OBATA AkioPR/47820 CVS commit: pkgsrc/x11/xf86-video-chips
Re: pkg/47820 (x11/xf86-video-chips 1.2.5 /bin/cp /usr/pkgsrc/x11/xf86-video-chips/files/iopl.h)
Re: pkg/47787 (www/squid3's LDAP helpers don't build on a system with non-native LDAP)
pkg/47836: Patch for lldpd to support options framework and xml option. Some cleaning up.
Ryo ONODERAPR/47801 CVS commit: pkgsrc/www/firefox
Ryo ONODERARe: pkg/47734: www/firefox17 install: /usr/pkgsrc/www/firefox17/work/.destdir/usr/pkg/bin/firefox17: No such file
David ShaoRe: pkg/47734: www/firefox17 install: /usr/pkgsrc/www/firefox17/work/.destdir/usr/pkg/bin/firefox17: No such file
David ShaoRe: pkg/47822: x11/modular-xorg-server 1.12.4 DragonFly x86_64 xf86_OSlib.h:284:27: fatal error: machine/mouse.h
David ShaoRe: pkg/47820: x11/xf86-video-chips 1.2.5 /bin/cp /usr/pkgsrc/x11/xf86-video-chips/files/iopl.h
Re: pkg/47820 (x11/xf86-video-chips 1.2.5 /bin/cp /usr/pkgsrc/x11/xf86-video-chips/files/iopl.h)
05/20/2013
Ryo ONODERARe: pkg/47734: www/firefox17 install: /usr/pkgsrc/www/firefox17/work/.destdir/usr/pkg/bin/firefox17: No such file
pkg/47838: PYTHON_FOR_BUILD_ONLY= tool can cause problems build openssl dependency for python
pkg/47839: problems building gcc on solaris if gcc-go included in options
Richard PALORe: pkg/47807 (pkgsrc/py-libxml2 seems to have path problems in build)
Richard PALORe: PR/47404 CVS commit: pkgsrc/devel/py-pysvn
Re: pkg/47839 (problems building gcc on solaris if gcc-go included in options)
Re: pkg/47838 (PYTHON_FOR_BUILD_ONLY= tool can cause problems build openssl dependency for python)
Re: pkg/47807 (pkgsrc/py-libxml2 seems to have path problems in build)
David ShaoRe: pkg/47734: www/firefox17 install: /usr/pkgsrc/www/firefox17/work/.destdir/usr/pkg/bin/firefox17: No such file
Ryo ONODERARe: pkg/47734: www/firefox17 install: /usr/pkgsrc/www/firefox17/work/.destdir/usr/pkg/bin/firefox17: No such file
Taylor R CampbellRe: pkg/47838 (PYTHON_FOR_BUILD_ONLY= tool can cause problems build openssl dependency for python)
Taylor R CampbellRe: pkg/47838 (PYTHON_FOR_BUILD_ONLY= tool can cause problems build openssl dependency for python)
Jukka Salmipkg/47843: update mail/opendkim to latest version (2.8.3)
pkg/47844: Update audio/musicpd to support newer version of ffmpeg
05/21/2013
Re: pkg/47843 (update mail/opendkim to latest version (2.8.3))
05/22/2013
pkg/47847:
Thomas KlausnerRe: pkg/47847:
David WetzelRe: pkg/47847:
David WetzelRe: pkg/47847:
05/23/2013
pkg/47848: devel/transifex-client points to wrong homepage
Takahiro KambePR/47848 CVS commit: pkgsrc/devel/transifex-client
Re: pkg/47848 (devel/transifex-client points to wrong homepage)
Re: pkg/45265 (visibility in graphics/MesaLib still broken with GCC 4.6 on Solaris)
05/24/2013
David ShaoRe: pkg/47734: www/firefox17 install: /usr/pkgsrc/www/firefox17/work/.destdir/usr/pkg/bin/firefox17: No such file
Re: pkg/47847 (libffi does not build)
Re: pkg/47845 (fail to install xulrunner-19.0.2nb1.tgz netbsd 6.1 amd64 wrong checksum)
05/25/2013
David ShaoRe: pkg/47734: www/firefox17 install: /usr/pkgsrc/www/firefox17/work/.destdir/usr/pkg/bin/firefox17: No such file
Ryo ONODERARe: pkg/47734: www/firefox17 install: /usr/pkgsrc/www/firefox17/work/.destdir/usr/pkg/bin/firefox17: No such file
05/26/2013
pkg/47854: netatalk 3.0.4 from sourceforge does not build on NetBSD 6.0.x
Thomas KlausnerRe: pkg/47854: netatalk 3.0.4 from sourceforge does not build on NetBSD 6.0.x
Thomas KlausnerPR/47844 CVS commit: pkgsrc/audio/musicpd
Hauke FathRe: pkg/47854: netatalk 3.0.4 from sourceforge does not build on NetBSD 6.0.x
Hauke FathRe: pkg/47854: netatalk 3.0.4 from sourceforge does not build on NetBSD 6.0.x
05/27/2013
Re: pkg/47844 (Update audio/musicpd to support newer version of ffmpeg)
pkg/47860: vtund SIGSEGV on amd64
=?ISO-8859-1?Q?J=F6rn_Clausen?=Re: pkg/45265 (visibility in graphics/MesaLib still broken with GCC 4.6 on Solaris)
=?ISO-8859-1?Q?J=F6rn_Clausen?=Re: pkg/45265 (visibility in graphics/MesaLib still broken with GCC 4.6 on Solaris)
05/28/2013
pkg/47862: graphics/MesaLib fails to build on NetBSD 6.0/amd64
Thomas KlausnerRe: pkg/47862: graphics/MesaLib fails to build on NetBSD 6.0/amd64
=?ISO-8859-1?Q?J=F6rn_Clausen?=Re: pkg/47862: graphics/MesaLib fails to build on NetBSD 6.0/amd64
=?ISO-8859-1?Q?J=F6rn_Clausen?=Re: pkg/47862: graphics/MesaLib fails to build on NetBSD 6.0/amd64
Thomas KlausnerRe: pkg/47862: graphics/MesaLib fails to build on NetBSD 6.0/amd64
=?ISO-8859-1?Q?J=F6rn_Clausen?=Re: pkg/47862: graphics/MesaLib fails to build on NetBSD 6.0/amd64
=?ISO-8859-1?Q?J=F6rn_Clausen?=Re: pkg/47862: graphics/MesaLib fails to build on NetBSD 6.0/amd64
Re: pkg/47862 (graphics/MesaLib fails to build on NetBSD 6.0/amd64)
Thomas KlausnerPR/47862 CVS commit: pkgsrc/graphics/MesaLib
05/29/2013
pkg/47865: devel/rcs fails to compile on Solaris
pkg/47866: net/nmap does not compile on Solaris 10
pkg/47867: graphics/openexr does not compile on Solaris 10
pkg/47868: www/libproxy does not compile on Solaris 10
Thomas KlausnerRe: pkg/47868: www/libproxy does not compile on Solaris 10
pkg/47869: libpcap symlink missing to install ntop
Thomas KlausnerRe: pkg/47869: libpcap symlink missing to install ntop
05/30/2013
Mathieu LubranoRe: pkg/47869: libpcap symlink missing to install ntop
Re: pkg/47869 (libpcap symlink missing to install ntop)
pkg/47870: math/nickle DragonFly readline USE_GNU_READLINE error: 'rl_catch_signals' undeclared
Re: pkg/47870 (math/nickle DragonFly readline USE_GNU_READLINE error: 'rl_catch_signals' undeclared)
Thomas KlausnerPR/47870 CVS commit: pkgsrc/math/nickle
David ShaoRe: pkg/47870: math/nickle DragonFly readline USE_GNU_READLINE error: 'rl_catch_signals' undeclared
05/31/2013
=?ISO-8859-1?Q?J=F6rn_Clausen?=Re: pkg/47868: www/libproxy does not compile on Solaris 10
=?ISO-8859-1?Q?J=F6rn_Clausen?=Re: pkg/47868: www/libproxy does not compile on Solaris 10
=?ISO-8859-1?Q?J=F6rn_Clausen?=Re: pkg/47868: www/libproxy does not compile on Solaris 10
=?ISO-8859-1?Q?J=F6rn_Clausen?=Re: pkg/47868: www/libproxy does not compile on Solaris 10
Thomas KlausnerPR/47868 CVS commit: pkgsrc/www/libproxy
Thomas KlausnerRe: pkg/47868: www/libproxy does not compile on Solaris 10
=?ISO-8859-1?Q?J=F6rn_Clausen?=Re: pkg/47868: www/libproxy does not compile on Solaris 10
=?ISO-8859-1?Q?J=F6rn_Clausen?=Re: pkg/47868: www/libproxy does not compile on Solaris 10
Re: pkg/47868 (www/libproxy does not compile on Solaris 10)
=?ISO-8859-1?Q?J=F6rn_Clausen?=Re: pkg/47868 (www/libproxy does not compile on Solaris 10)
=?ISO-8859-1?Q?J=F6rn_Clausen?=Re: pkg/47868 (www/libproxy does not compile on Solaris 10)
Re: pkg/47868 (www/libproxy does not compile on Solaris 10)
Thomas KlausnerRe: pkg/47868 (www/libproxy does not compile on Solaris 10)
=?ISO-8859-1?Q?J=F6rn_Clausen?=Re: pkg/47868 (www/libproxy does not compile on Solaris 10)
Thomas KlausnerPR/47868 CVS commit: pkgsrc/www/libproxy
=?ISO-8859-1?Q?J=F6rn_Clausen?=Re: pkg/47868 (www/libproxy does not compile on Solaris 10)
Re: pkg/47868 (www/libproxy does not compile on Solaris 10)
Thomas KlausnerRe: pkg/47868 (www/libproxy does not compile on Solaris 10)
=?ISO-8859-1?Q?J=F6rn_Clausen?=Re: pkg/47868 (www/libproxy does not compile on Solaris 10)
pkg/47872: graphics/gimp-help-XX are out of date