pkgsrc-Users archive

[Date Prev][Date Next][Thread Prev][Thread Next][Date Index][Thread Index][Old Index]

Re: Testers needed for erlang

On 24 February 2010 13:34, Martti Kuparinen <> 
> I've updated the erlang package to R13B04 and I'd like to get some feedback
> before I commit this. Please try this and report how it works...

> cd /tmp
> ftp
> cd /usr/pkgsrc/lang
> mv erlang erlang.orig
> tar -xzf /tmp/erlang13b4.tgz
> cd erlang
> make

'make test' fails at the end with:

/usr/bin/install -c -o root -g wheel -m 444 ct_test_support.erl
ct_test_support_eh.erl ct_smoke_test_SUITE.erl
ct_event_handler_SUITE.erl ct_groups_test_1_SUITE.erl
ct_groups_test_2_SUITE.erl ct_skip_SUITE.erl ct_error_SUITE.erl
/usr/bin/install -c -s -o root -g wheel -m 555 common_test.spec
File format not recognized
install: stripping
No such file or directory
make[2]: *** [release_tests_spec] Error 1
make[2]: Leaving directory
make[1]: *** [release_tests] Error 2
make[1]: Leaving directory
gmake: *** [lib/common_test/test] Error 2
*** Error code 2

make: stopped in /usr/pkgsrc/lang/erlang
*** Error code 1

make: stopped in /usr/pkgsrc/lang/erlang

but that probably is non-consequential.

This is on

 # uname -a
NetBSD loan8 5.99.24 NetBSD 5.99.24 (GENERIC) #3: Sun Feb  7 17:31:32
GMT 2010  root@uksup2:/usr/obj/usr-current/i386/sys/arch/i386/compile/GENERIC

Chavdar Ivanov
Marie von Ebner-Eschenbach  - "Even a stopped clock is right twice a
day." -

Home | Main Index | Thread Index | Old Index