Current-Users archive

[Date Prev][Date Next][Thread Prev][Thread Next][Date Index][Thread Index][Old Index]

Re: tool build failure

On Oct 31,  9:02am, (Malcolm Herbert) wrote:
-- Subject: Re: tool build failure

| After the CVS update I do have version 1.5 of this file, however the build
| fails again a little later in the ' release' process:
| |#   compile  mkmake/mkmake.lo
| |cc -O -DHOST_TOOL -I/usr/src/usr.bin/tn3270/tools/mkmake/../../api -c -o 
mkmake.lo.o    mkmake.c
| |/usr/src/usr.bin/tn3270/tools/mkmake/mkmake.y: In function 'yylex':
| |/usr/src/usr.bin/tn3270/tools/mkmake/mkmake.y:981: error: 'yyval' undeclared 
(first use in this function)
| |/usr/src/usr.bin/tn3270/tools/mkmake/mkmake.y:981: error: (Each undeclared 
identifier is reported only once
| |/usr/src/usr.bin/tn3270/tools/mkmake/mkmake.y:981: error: for each function 
it appears in.)
| |
| |*** Failed target:  mkmake.lo
| |*** Failed command: cc -O -DHOST_TOOL 
-I/usr/src/usr.bin/tn3270/tools/mkmake/../../api -c -o
| |mkmake.lo.o mkmake.c
| |*** Error code 1

cvs update mkmake.y. It was fixed earlier today.


Home | Main Index | Thread Index | Old Index