Current-Users archive

[Date Prev][Date Next][Thread Prev][Thread Next][Date Index][Thread Index][Old Index]

Re: tool build failure

On Thu, Oct 29, 2009 at 11:34:54PM +0000, Christos Zoulas wrote:
|In article <>, Malcolm Herbert  
<> wrote:
|>... not sure whether that's a problem with the source that nblex was
|>working on, or a problem with nblex itself ... any pointers?
|Do you have revision 1.5 of /usr/src/external/bsd/flex/bin/Makefile?

After the CVS update I do have version 1.5 of this file, however the build
fails again a little later in the ' release' process:

|#   compile  mkmake/mkmake.lo
|cc -O -DHOST_TOOL -I/usr/src/usr.bin/tn3270/tools/mkmake/../../api -c -o 
mkmake.lo.o    mkmake.c
|/usr/src/usr.bin/tn3270/tools/mkmake/mkmake.y: In function 'yylex':
|/usr/src/usr.bin/tn3270/tools/mkmake/mkmake.y:981: error: 'yyval' undeclared 
(first use in this function)
|/usr/src/usr.bin/tn3270/tools/mkmake/mkmake.y:981: error: (Each undeclared 
identifier is reported only once
|/usr/src/usr.bin/tn3270/tools/mkmake/mkmake.y:981: error: for each function it 
appears in.)
|*** Failed target:  mkmake.lo
|*** Failed command: cc -O -DHOST_TOOL 
-I/usr/src/usr.bin/tn3270/tools/mkmake/../../api -c -o
|mkmake.lo.o mkmake.c
|*** Error code 1

nbmake: stopped in /usr/src/usr.bin/tn3270/tools/mkmake

Malcolm Herbert                                This brain intentionally                                                left 

Home | Main Index | Thread Index | Old Index