pkgsrc-Users archive

[Date Prev][Date Next][Thread Prev][Thread Next][Date Index][Thread Index][Old Index]

security/cyrus-sasl not building

With pkgsrc HEAD and all installed packages no older than a few days ago, 
-current as of this morning (5.99.56), amd64:

/bin/sh ../libtool   --mode=link gcc  -Wall -W -O2 -module -export-dynamic 
-rpath /usr/pkg/lib/sasl2 -version-info 2:25:0 -Wl,-R/usr/pkg/lib -o  sasldb.lo sasldb_init.lo plugin_common.lo ../sasldb/  
libtool: link: gcc -shared  .libs/sasldb.o .libs/sasldb_init.o 
.libs/plugin_common.o  -Wl,--whole-archive ../sasldb/.libs/libsasldb.a 
-Wl,--no-whole-archive  -L/usr/pkgsrc/security/cyrus-sasl/work/.buildlink/lib 
-lresolv  -Wl,-R/usr/pkg/lib   -Wl,-soname -Wl, -o 
ld: ../sasldb/.libs/libsasldb.a(allockey.o): relocation R_X86_64_32 against `a 
local symbol' can not be used when making a shared object; recompile with -fPIC
../sasldb/.libs/libsasldb.a(allockey.o): could not read symbols: Bad value
gmake[2]: *** [] Error 1
gmake[2]: Leaving directory 
gmake[1]: *** [all-recursive] Error 1
gmake[1]: Leaving directory 
gmake: *** [all] Error 2
*** Error code 2

make: stopped in /usr/pkgsrc/security/cyrus-sasl
*** Error code 1

make: stopped in /usr/pkgsrc/security/cyrus-sasl

                --Steve Bellovin,

Home | Main Index | Thread Index | Old Index