pkgsrc-Users archive

[Date Prev][Date Next][Thread Prev][Thread Next][Date Index][Thread Index][Old Index]

fall-out of ssl update or local problem here - building kdelibs3

After updating -current as of today, I see this while building kdelibs3:

gmake[5]: Entering directory
/bin/sh ../../libtool --silent --tag=CXX   --mode=compile c++
-DHAVE_CONFIG_H -I. -I../.. -I../../dcop -I../../kdecore -I../../kjs
-I../../kdecore/network -I../../kwallet/client -I../../dcop
-I../../libltdl -I../../kdefx -I../../kdecore -I../../kdecore
-I../../kdecore/network -I../../kdeui -I../../kio -I../../kio/kio
-I../../kio/kfile -I../.. -I/usr/pkg/qt3/include -I/usr/pkg/include
-I/usr/pkg/include -I/usr/pkg/include -I/usr/pkg/include
-DQT_THREAD_SUPPORT -I/usr/include/krb5 -I/usr/include
-I/usr/pkg/include -I/usr/pkg/qt3/include -I/usr/pkg/include/freetype2
 -Wno-long-long -Wundef -Wall -W -Wpointer-arith -DNDEBUG -DNO_DEBUG
-O2 -O2 -I/usr/include/krb5 -I/usr/include -I/usr/pkg/include
-I/usr/pkg/qt3/include -I/usr/pkg/include/freetype2
-Wno-non-virtual-dtor -fno-exceptions -fno-check-new -fno-common
-DQT_NO_TRANSLATION  -MT kssl.lo -MD -MP -MF .deps/kssl.Tpo -c -o
./kopenssl.h:453: error: ISO C++ forbids declaration of 'ASN1_METHOD'
with no type
./kopenssl.h:453: error: expected ';' before '*' token
gmake[5]: *** [kssl.lo] Error 1
gmake[5]: Leaving directory

a local problem -- or a fall-out of the openssl update a few days ago?

kind regards
- Erik

Home | Main Index | Thread Index | Old Index