pkgsrc-Users archive

[Date Prev][Date Next][Thread Prev][Thread Next][Date Index][Thread Index][Old Index]

ORBit2 build fails

On a NetBSD 4.0 Stable (i386) system trying to build ORBit2 results in the following message:

cc -DHAVE_CONFIG_H -I. -I../.. -I../.. -I../../include -I../.. -I../../ include -DORBIT_BACKENDS_DIR="\"/usr/pkg/lib/orbit-2.0/idl-backends\"" -DVERSION=\"2.14.12\" -DORBIT2_INTERNAL_API -Wall -Wunused -Wmissing- prototypes -Wmissing-declarations -DG_DISABLE_DEPRECATED -I/usr/pkg/ include/libIDL-2.0 -I/usr/pkg/include/glib/glib-2.0 -I/usr/pkg/lib/ glib-2.0/include -DINET6 -I/usr/pkg/include -I/usr/include -O2 - mfpmath=sse -msse2 -march=k8 -I/usr/pkg/include -I/usr/include -Werror- implicit-function-declaration -MT orbit-idl-driver.o -MD -MP - MF .deps/orbit-idl-driver.Tpo -c -o orbit-idl-driver.o orbit-idl- driver.c
orbit-idl-driver.c: In function 'orbit_idl_tree_fake_ops':
orbit-idl-driver.c:43: error: 'G_GNUC_PRETTY_FUNCTION' undeclared (first use in this function) orbit-idl-driver.c:43: error: (Each undeclared identifier is reported only once
orbit-idl-driver.c:43: error: for each function it appears in.)
gmake[3]: *** [orbit-idl-driver.o] Error 1
gmake[3]: Leaving directory `/usr/pkgsrc/net/ORBit2/work.i386/ ORBit2-2.14.12/src/idl-compiler'
gmake[2]: *** [all-recursive] Error 1
gmake[2]: Leaving directory `/usr/pkgsrc/net/ORBit2/work.i386/ ORBit2-2.14.12/src'
gmake[1]: *** [all-recursive] Error 1
gmake[1]: Leaving directory `/usr/pkgsrc/net/ORBit2/work.i386/ ORBit2-2.14.12'
gmake: *** [all] Error 2
*** Error code 2

A little googling seemed to indicate that the problem was in glib, so I rebuilt glib2-2.16.3nb1 but still got the problem above.

Any thoughts?



Home | Main Index | Thread Index | Old Index