Current-Users archive

[Date Prev][Date Next][Thread Prev][Thread Next][Date Index][Thread Index][Old Index]

Automated report: NetBSD-current/i386 build failure

This is an automatically generated notice of a NetBSD-current/i386
build failure.

The failure occurred on, a NetBSD/amd64 host,
using sources from CVS date 2012.

An extract from the output follows:

    --- main.lo ---
    /usr/include/uvm/uvm_map.h:222: error: expected specifier-qualifier-list 
before 'vsize_t'
    In file included from /usr/include/uvm/uvm_extern.h:476,
                     from /usr/include/sys/sysctl.h:47,
    /usr/include/uvm/uvm_pager.h:139: error: expected declaration specifiers or 
'...' before 'vaddr_t'
    --- dependall-lint1 ---
    --- err.lo ---
    --- dependall-config ---
    *** [main.lo] Error code 1
    nbmake: stopped in 
    --- dependall-makefs ---

The following commits were made between the last successful build and the 
failed build:

    2012. christos src/usr.bin/config/config.1,v 1.11
    2012. christos src/usr.bin/config/main.c,v 1.48
    2012. christos src/usr.bin/config/config.1,v 1.12
    2012. wiz src/usr.bin/config/config.1,v 1.13

Log files can be found at:

Home | Main Index | Thread Index | Old Index