pkgsrc-Bulk archive

[Date Prev][Date Next][Thread Prev][Thread Next][Date Index][Thread Index][Old Index]

Re: pkgsrc 2012Q1 NetBSD 6.0_BETA2/powerpc bulk build results 20120531.2159

On Wed, Jun 27, 2012 at 02:53:01PM +0200, Havard Eidnes wrote:
 > Broken packages
 > Package                    Breaks  Maintainer
 > --------------------------------------------------------------
 > archivers/star           
 > audio/xcdplayer          
 > devel/electric-fence     
 > devel/p5-VCP               1
 > devel/tvision            
 > emulators/kegs                     
 > emulators/palmosemulator 
 > emulators/xbeeb          
 > fonts/ja-elisat            1
 > fonts/ja-elisau          
 > fonts/ja-kaname          
 > fonts/misaki-fonts       
 > graphics/py-matplotlib-tk
 > math/capc-calc           
 > net/nasd                 
 > net/openafs              
 > news/nget                
 > print/jcabc2ps           
 > sysutils/fixelfprot      
 > sysutils/sformat         
 > wm/blackbox70              2

These are fixed on HEAD.

 > devel/teem               
 > wm/obconf                

Not buildable; masked on HEAD.

 > audio/xine-arts          
 > games/ultima4-data       
 > net/ispman               

Invalid package; removed on HEAD.

 > databases/gramps         
 > devel/ruby-eet           
 > devel/ruby-rbx-require-relative 4
 > devel/ruby-rcov          
 > graphics/ruby-clutter-core 4
 > inputmethod/prime          2
 > lang/ruby18              
 > lang/ruby19              
 > textproc/migemo            2
 > textproc/ruby-eruby        1
 > textproc/xhtmldiff       
 > www/phraseanet           
 > www/ruby-actionpack3       7
 > www/ruby-actionpack31      5
 > x11/py-gtk2                151

It looks as if the old bulk build logic is not handling multiversion
Python or Ruby packages right any more. (It also appears to be wasting
a lot of build time recompiling wrong versions of the Python ones.)
Maybe also php packages; not sure about phraseanet.

Change to pbulk?

 > archivers/arj            

Crashes during build. Try the version from pkgsrc-HEAD as something
has been fixed since 2012Q1.

 > audio/blop                error: 'inff' undeclared here (not in a 

 > audio/goom                 1

/bin/sh ../libtool --mode=compile    -force_cpusubtype_ALL -c -o 
ppc_zoom_ultimate.lo ppc_zoom_ultimate.s
libtool: compile: unrecognized option `-force_cpusubtype_ALL'

 > audio/libmpg123          

configure: error: Unknown CPU type 'altvec'

 > audio/libvisual0.2         2

configure: error: C++ compiler cannot create executables
See `config.log' for more details.

 > audio/pulseaudio           268

utils/padsp.c:2348:5: error: conflicting types for '_oss_ioctl'
/usr/include/soundcard.h:304:5: note: previous declaration of '_oss_ioctl' was 

This is supposed to have been fixed.

 > audio/xanalyser           fatal error: machine/byte_swap.h: No such file or directory

 > comms/asterisk           

cc1: error: unrecognized command line option "-march=powerpc"

 > devel/bin86                1

catimage.c:27:2: error: #error "Compile error: struct exec invalid (long not 32 
bit ?)"

 > devel/blame              

mktime.c: In function 'ydhms_diff':
mktime.c:170:3: error: size of array 'a' is negative

  verify (long_int_year_and_yday_are_wide_enough,
     INT_MAX <= LONG_MAX / 2 || TIME_T_MAX <= UINT_MAX);

I guess this package doesn't like 64-bit time_t on a 32-bit platform;
although I suppose the real question is why it's compiling its own

 > devel/coccinelle           1

Error: Cannot find file dynlink.cmxa

 > devel/doxygen              50

Dumps core during build.

 > devel/gentle               1

+ /usr/pkg/bin/libtool --mode=compile cc -c 'main.c'
libtool: compile: unable to infer tagged configuration
libtool: compile: specify a tag with `--tag'
*** Error code 1

That doesn't entirely make sense...

 > devel/pcc-libs           

PLIST divergence on crtstuff.

 > devel/scmgit-docs          5

=> Checking for portability problems in extracted files
[1]   Terminated              env CK_FNAME="${...
*** Error code 1


 > editors/OmegaT           

/usr/pkgsrc/editors/OmegaT/work/nbproject/build-impl.xml:420: The following 
error occurred while executing this line:
/usr/pkgsrc/editors/OmegaT/work/nbproject/build-impl.xml:199: Compile failed; 
see the compiler error output for details.

 > editors/emacs              89

This dies on ethio-util.el (with SIGSEGV), which I'm pretty sure is
the same problem I've been seeing on 5.1_STABLE and i386, although
there it doesn't crash but throws a fairly weird error.

 > emulators/darwin_lib       6

Fetch failure.

 > games/plib                 3

jsBSD.cxx:53:56: fatal error: machine/joystick.h: No such file or directory

 > games/qnetwalk           
 > net/kiax                 
 > security/qca             
 > wm/icecc                 

cp -f "qnetwalk.6" 

same qmake horrors I get in my test build environment.

 > graphics/cnxtview        
 > graphics/cpia2view       

jpeg_decode.c:85:1: error: conflicting types for 'jpeg_mem_src'
/usr/pkgsrc/graphics/cnxtview/work/.buildlink/include/jpeglib.h:961:14: note: 
previous declaration of 'jpeg_mem_src' was here

I'm sure this was fixed, but I can't find where.

 > graphics/cqcam           

port.C:53:29: fatal error: machine/sysarch.h: No such file or directory

 > graphics/fly             

cd /usr/pkgsrc/graphics/fly/work/fly-1.6.5/doc; /usr/pkg/bin/gif2png *.gif
gif2png: error in reading DataBlock
gif2png: EOF / read error on image data

Build host problem?

 > graphics/freeglut        

freeglut_joystick.c:66:37: fatal error: machine/joystick.h: No such file or 

 > graphics/libvideogfx       1 In member function 'void videogfx::BitReader::Refill()': error: lvalue required as increment operand

 > lang/coq                           richards+netbsd%CS.Princeton.EDU@localhost

COQC      plugins/setoid_ring/Ring_polynom.v
gmake[1]: *** [plugins/setoid_ring/Ring_polynom.vo] Segmentation fault (core 

...which stands a good chance of actually being a code generation bug
in ocaml. blah

 > lang/ecl                 

;;; Loading src:lsp;helpfile.lsp
[1]   Illegal instruction (core dumped) ECLDIR=$(...)/ ....
gmake[1]: *** [bin/ecl] Error 132

 > lang/g95                   44
 > lang/gcc3-f77              2
 > lang/gcc3-objc             1
 > lang/gcc34                 1

/usr/pkgsrc/lang/g95/work/gcc-4.0.3/g95/gcc/ Unsupported 
relocation type 10 in non-PLT relocations

/usr/pkg/gcc3/lib/ Unsupported relocation type 10 in non-PLT 

/usr/pkgsrc/lang/gcc34/work/obj/gcc/ Unsupported relocation type 
10 in non-PLT relocations

 > lang/gcc44               
 > lang/gcc45               

/usr/pkgsrc/lang/gcc44/work/gcc-4.4.7/gcc/gcc.c:765:31: error: expected ',' or 
';' before 'SVR4_ASM_SPEC'

/usr/pkgsrc/lang/gcc45/work/gcc-4.5.3/gcc/gcc.c:829:31: error: expected ',' or 
';' before 'SVR4_ASM_SPEC'

 > lang/gcc46               

checking for suffix of object files... configure: error: in 
configure: error: cannot compute suffix of object files: cannot compile
See `config.log' for more details.
gmake[2]: *** [configure-stage1-target-libgcc] Error 1

 > lang/gprolog             

/var/tmp/gplcY71k5c.s:127: Error: unknown pseudo-op: `.mod_init_func'

 > lang/guile16               4

ERROR: Stack overflow

as it's an old version, perhaps this should just be masked?

 > lang/japhar              

configure: error: Unsupported platform.\n  Check 
./lib/libjni/include/jnitypes.frag to see if types are correct, and\n  update

(yes, with a literal \n in the message)

 > lang/oo2c                

stage0/oo2c --config oo2crc-install.xml -r lib -r .  --build-package liboo2c
gmake: *** [lib/obj/] Illegal instruction (core dumped)

 > lang/pfe                 

../../pfe/debug-ext.c: In function 'is_sbr_compile_call_to':
../../pfe/debug-ext.c:448:5: error: lvalue required as increment operand
../../pfe/debug-ext.c:456:5: error: lvalue required as increment operand

 > lang/racket              

 expand: unbound identifier in module (in phase 1, transformer environment) in: 

 > lang/racket-textual      

configure: error: "libffi has not been ported to powerpc--netbsd."

(don't ask me why it's different from lang/racket)

 > lang/sablevm-classpath     2

ieeefp.h:160:2: error: #error Endianess not declared!!

 > lang/sather              

Boot/sacomp     -verbose -O_fast -O_no_move_while -O_no_hoist_const -O_no_cse 
-only_reachable Compiler/sacomp.module -o Bin/sacomp -only_C
Initializing... gmake: *** [compiler] Illegal instruction (core dumped)

 > lang/sbcl                

=> Checking file-check results for sbcl-1.0.55
ERROR: ************************************************************
ERROR: The following files are in the PLIST but not in /usr/pkg:
ERROR: ************************************************************
ERROR: The following files are in /usr/pkg but not in the PLIST:
*** Error code 1

 > lang/smlnj                 1       richards+netbsd%CS.Princeton.EDU@localhost

No bootstrap file.

 > lang/spidermonkey          3

ld: pkgsrc_OPT.OBJ/js: hidden symbol `_savefpr_29' in 
/usr/lib/libgcc.a(crtsavfpr.o) is referenced by DSO
ld: final link failed: Bad value

 > math/algae               

checking for proper floating point exception handling... no
configure: error: Cannot handle floating point exceptions.

 > misc/php-orangehrm       

Bazillions of world-writeable files. Try the version from HEAD as it's
been updated and I think also fixed.

 > misc/taskjuggler         

Fails self-tests due to endianness bugs.

 > multimedia/handbrake     

Altivec support is not (remotely) compilable.

 > multimedia/libmpeg2        12

Altivec support is not (remotely) compilable.

 > net/ortp                   2
 > net/p5-Net-DBus            5

/usr/pkg/bin/perl /usr/pkg/lib/perl5/5.14.0/ExtUtils/xsubpp  -typemap 
/usr/pkg/lib/perl5/5.14.0/ExtUtils/typemap -typemap typemap  DBus.xs > DBus.xsc 
&& mv DBus.xsc DBus.c
panic: memory wrap at /usr/pkg/lib/perl5/5.14.0/ExtUtils/ line 1712, 
<GEN0> line 1397.

 > net/ser                  

ip_tree.c: In function 'init_ip_tree':
ip_tree.c:108:49: error: 'gen_lock_set_t' has no member named 'locks'

 > net/xorp                  In member function 'size_t IPvX::copy_out(sockaddr_in&) const': error: cast from 'sockaddr_in*' to 'sockaddr_in6*' increases 
required alignment of target type In member function 'size_t IPvX::copy_in(const sockaddr_in&)': error: cast from 'const sockaddr_in*' to 'const sockaddr_in6*' 
increases required alignment of target type

 > parallel/threadingbuildingblocks

build/ *** Architecture not detected.  Stop.

 > pkgtools/packagekit        1

pk-gtk-module.c: In function 'fontset_foreach_cb':
pk-gtk-module.c:209:24: error: cast increases required alignment of target type

 > print/lilypond             1


 > print/podofo               2

PdfString.cpp:(.text+0x1e5c): undefined reference to `alloca'

 > print/tex-igo            

ERROR: ************************************************************
ERROR: The following files are in the PLIST but not in /usr/pkg:

 > print/tex-texmate        

ERROR: [] A package matching ``tex-chessfss-[0-9]*'' should
ERROR:     be installed, but one cannot be found.  Perhaps there is a
ERROR:     stale work directory for ../../print/tex-skaknew?


 > security/aide06          

md5.c: In function 'md5_final':
md5.c:309:1: error: pasting "->" and "A" does not give a valid preprocessing 


 > security/beecrypt        

blowfishopt.s:61: Error: unsupported relocation against r1

 > security/prelude-lml     

mktime.c: In function 'ydhms_diff':
mktime.c:168:3: error: size of array 'a' is negative

probably the same GNU mktime as devel/blame...

 > security/rainbowcrack    

/usr/include/des.h:69:0: warning: "DES_LONG" redefined
/usr/include/openssl/des.h:109:0: note: this is the location of the previous 

 > sysutils/flashrom        

Checking for libpci headers... found.
Checking if libpci is present and sufficient... no.
Checking if libz+libpci are present and

Looks like it's missing a zlib buildlink, but that doesn't look like
it's the whole problem.

 > www/dansguardian         

ConnectionHandler.cpp:1175:66: error: call of overloaded 'String(time_t)' is 
String.hpp:40:5: note: candidates are: String::String(long int)
String.hpp:39:5: note:                 String::String(int)
String.hpp:38:5: note:                 String::String(const String&)
String.hpp:37:5: note:                 String::String(const char*) <near match>

Needs long long in there.

 > www/webkit-gtk             13
 > www/webkit-gtk3            1

  CXX    Source/JavaScriptCore/wtf/libjavascriptcoregtk_1_0_la-TCSystemAlloc.lo
gmake[1]: *** 
[Source/JavaScriptCore/wtf/libjavascriptcoregtk_1_0_la-TCSystemAlloc.lo] Error 1

Hurray for libtool...

 > x11/labltk               

ERROR: ************************************************************
ERROR: The following files are in /usr/pkg but not in the PLIST:

Also, all the mozilla packages (xulrunner, seamonkey, etc.) are
failing because they can't find jstl.h, whatever that is.

David A. Holland

Home | Main Index | Thread Index | Old Index