pkgsrc-Bugs archive

[Date Prev][Date Next][Thread Prev][Thread Next][Date Index][Thread Index][Old Index]

pkg/41575: x11/modular-xorg-server fails to compile on FreeBSD 7.1

>Number:         41575
>Category:       pkg
>Synopsis:       x11/modular-xorg-server fails to compile on FreeBSD 7.1
>Confidential:   no
>Severity:       non-critical
>Priority:       medium
>Responsible:    pkg-manager
>State:          open
>Class:          sw-bug
>Submitter-Id:   net
>Arrival-Date:   Thu Jun 11 17:20:00 +0000 2009
>Originator:     Mikko Kortelainen
>Release:        -
matrix:~/pkgsrc/x11/modular-xorg-server> uname -a
FreeBSD 7.1-RELEASE FreeBSD 7.1-RELEASE #0: Fri Feb 13 
04:58:44 CET 2009  

x11/modular-xorg-server fails to compile on FreeBSD

mv -f .deps/window.Tpo .deps/window.Plo
../doltlibtool --tag=CC   --mode=link cc -DHAVE_DIX_CONFIG_H -Wall 
-Wpointer-arith -Wstrict-prototypes -Wmissing-prototypes -Wmissing-declarations 
-Wnested-externs -fno-strict-aliasing -D_BSD_SOURCE -DHAS_FCHOWN 
-DHAS_STICKY_DIR_BIT -D_THREAD_SAFE -I/home/kordex/pkg/include 
-I/home/kordex/pkg/include/freetype2 -I/home/kordex/pkg/include/pixman-1    
-I../include -I../include -I../Xext -I../composite -I../damageext -I../xfixes 
-I../Xi -I../mi -I../miext/shadow  -I../miext/damage -I../render -I../randr 
-I../fb -DVENDOR_NAME=\""The NetBSD Foundation"\" -DVENDOR_RELEASE="(((1) * 
10000000) + ((6) * 100000) + ((1) * 1000) + 901)" -O2 -I/usr/include 
-I/home/kordex/pkg/include -I/home/kordex/pkg/include/freetype2  -L/usr/lib 
-Wl,-R/usr/lib -L/home/kordex/pkg/lib -Wl,-R/home/kordex/pkg/lib -o  
atom.lo colormap.lo cursor.lo deprecated.lo devices.lo dispatch.lo dixfonts.lo 
dixutils.lo enterleave.lo events.lo extension.lo ffs.lo gc.lo getevents.lo 
globals.lo glyphcurs.lo grabs.l
 o initatoms.lo main.lo pixmap.lo privates.lo property.lo ptrveloc.lo 
registry.lo resource.lo selection.lo swaprep.lo swapreq.lo tables.lo window.lo  
-lrpcsvc -lm
ar cru .libs/libdix.a .libs/atom.o .libs/colormap.o .libs/cursor.o 
.libs/deprecated.o .libs/devices.o .libs/dispatch.o .libs/dixfonts.o 
.libs/dixutils.o .libs/enterleave.o .libs/events.o .libs/extension.o 
.libs/ffs.o .libs/gc.o .libs/getevents.o .libs/globals.o .libs/glyphcurs.o 
.libs/grabs.o .libs/initatoms.o .libs/main.o .libs/pixmap.o .libs/privates.o 
.libs/property.o .libs/ptrveloc.o .libs/registry.o .libs/resource.o 
.libs/selection.o .libs/swaprep.o .libs/swapreq.o .libs/tables.o .libs/window.o
ranlib .libs/libdix.a
(cd .libs && rm -f && ln -s ../
/usr/sbin/dtrace -G -C -o dtrace-dix.o -s ../dix/Xserver.d .libs/*.o
dtrace: failed to compile script ../dix/Xserver.d: "/usr/lib/dtrace/psinfo.d", 
line 37: syntax error near "uid_t"
gmake[2]: *** [dtrace-dix.o] Error 1
gmake[2]: Leaving directory 
gmake[1]: *** [all] Error 2
gmake[1]: Leaving directory 
gmake: *** [all-recursive] Error 1
*** Error code 2

bmake: stopped in /home/kordex/pkgsrc/x11/modular-xorg-server
*** Error code 1

cd pkgsrc/x11/modular-xorg-server && bmake compile, options used -dri and +dri, 
does not change result.

Home | Main Index | Thread Index | Old Index