pkgsrc-Bugs archive

[Date Prev][Date Next][Thread Prev][Thread Next][Date Index][Thread Index][Old Index]

pkg/36771: Transmission 0.80 doesn't build...

>Number:         36771
>Category:       pkg
>Synopsis:       Transmission 0.80 doesn't build.
>Confidential:   no
>Severity:       serious
>Priority:       medium
>Responsible:    pkg-manager
>State:          open
>Class:          sw-bug
>Submitter-Id:   net
>Arrival-Date:   Sat Aug 11 06:05:00 +0000 2007
>Originator: Root
>Release:        NetBSD 3.1
Famille Gravier
System: NetBSD mailhost 3.1 NetBSD 3.1 (MAILHOST) #0: Fri May 25 13:28:50 CEST 
2007 root@mailhost:/usr/src/sys/arch/i386/compile/MAILHOST i386
Architecture: i386
Machine: i386
        When building the latest Transmission 0.80 from pkgsrc, it fails during 
compile time with the following error message :

Cc daemon.o
daemon.c: In function `main':
daemon.c:93: error: void value not ignored as it ought to be
Compile line for daemon.o was:
-DHAVE_OPENSSL -O2 -I/usr/pkg/include -I/usr/include 
-I/usr/pkg/include/freetype2 -I/usr/X11R6/include -DHAVE_STRLCPY -DHAVE_STRLCAT 
gmake[2]: *** [daemon.o] Error 1
gmake[1]: *** [.daemon] Error 2
gmake: *** [all] Error 2
*** Error code 2

        cd /usr/pkgsrc/*/Transmission
        Ask package maintainer to fix.

Home | Main Index | Thread Index | Old Index