Current-Users archive

[Date Prev][Date Next][Thread Prev][Thread Next][Date Index][Thread Index][Old Index]

Automated report: NetBSD-current/i386 build failure

This is an automatically generated notice of a NetBSD-current/i386
build failure.

The failure occurred on, a NetBSD/amd64 host,
using sources from CVS date 2019.

An extract from the output follows:

    t_subr_prf.c: In function 'vasprintf':
    t_subr_prf.c:163:8: error: implicit declaration of function 'kmem_alloc'; did you mean 'tzalloc'? [-Werror=implicit-function-declaration]
      *bf = kmem_alloc(retval, KM_SLEEP);
    t_subr_prf.c:163:27: error: 'KM_SLEEP' undeclared (first use in this function)
      *bf = kmem_alloc(retval, KM_SLEEP);
    --- dependall-usr.sbin ---
    /tmp/bracket/build/2019. -g -L VERSION autounmountd.o
    --- common.o ---
    #   compile  autofs/common.o
    /tmp/bracket/build/2019. -O2 -I/tmp/bracket/build/2019. -I/tmp/bracket/build/2019.   -fPIE    -std=gnu99    -Wall -Wstrict-prototypes -Wmissing-prototypes -Wpointer-arith -Wno-sign-compare  -Wsystem-headers   -Wno-traditional   -Wa,--fatal-warnings  -Wreturn-type -Wswitch -Wshadow -Wcast-qual -Wwrite-strings -Wextra -Wno-unused-parameter -Wno-sign-compare -Wold-style-definition -Wconversion -Wsign-compare -Wformat=2  -Wno-format-zero-length  -Werror     -D_KERNTYPES --sysroot=/tmp/bracket/build/2019.  -c    /tmp/bracket/build/2019.
    --- dependall-sys ---
    --- dependall-modules ---
    /tmp/bracket/build/2019. -L VERSION kern_50.o
    --- dependall-tests ---
    t_subr_prf.c:163:27: note: each undeclared identifier is reported only once for each function it appears in
    cc1: all warnings being treated as errors
    --- dependall-sys ---
    --- kern_time_50.o ---
    #   compile  compat_50/kern_time_50.o
    /tmp/bracket/build/2019. -O2 -g   -std=gnu99    -Wall -Wstrict-prototypes -Wmissing-prototypes -Wpointer-arith -Wno-sign-compare  -Wsystem-headers   -Wno-traditional   -Wa,--fatal-warnings  -Wreturn-type -Wswitch -Wshadow -Wcast-qual -Wwrite-strings -Wextra -Wno-unused-parameter -Wno-sign-compare -Werror   -ffreestanding  -fno-strict-aliasing -Wno-pointer-sign -msoft-float -mno-mmx -mno-sse -mno-avx -fno-omit-frame-pointer -msoft-float -mno-mmx -mno-sse -mno-avx -fno-omit-frame-pointer   -I/tmp/bracket/build/2019. -DDIAGNOSTIC --sysroot=/tmp/bracket/build/2019. -DCOMPAT_50 -DCOMPAT_60 -DCOMPAT_70 -DCOMPAT_80 -DINET -DINET6 -I/tmp/bracket/build/2019. -DDIAGNOSTIC  -nostdinc -I. -I/tmp/bracket/build/2019. -isystem /tmp/bracket/build/2019. -isystem /tmp/bracket/b
 uild/2019. -isystem /tmp/bracket/build/2019. -D_KERNEL -D_LKM -D_MODULE -DSYSCTL_INCLUDE_DESCR -c    /tmp/bracket/build/2019.
    --- dependall-games ---
    /tmp/bracket/build/2019. -g -L VERSION canfield.o
    --- dependall-external ---
    --- dependall-bsd ---
    /tmp/bracket/build/2019. -g -L VERSION dtparserlex.o
    --- dependall-games ---
    --- canfield ---
    #      link  canfield/canfield
    /tmp/bracket/build/2019.    --sysroot=/tmp/bracket/build/2019.   -pie  -shared-libgcc  -Wl,--warn-shared-textrel -Wl,-z,relro     -o canfield  canfield.o  -Wl,-rpath-link,/tmp/bracket/build/2019.  -L=/lib -lcurses -lterminfo    
    --- dependall-external ---
    --- dtparserparse.o ---
    --- dependall-sbin ---
    /tmp/bracket/build/2019. -g -L VERSION env.o
    --- dependall-external ---
    #   compile  iasl/dtparserparse.o
    /tmp/bracket/build/2019. -O2   -fPIE    -std=gnu99    -Werror     --sysroot=/tmp/bracket/build/2019. -I/tmp/bracket/build/2019. -I/tmp/bracket/build/2019. -I. -DACPI_ASL_COMPILER -DACPI_USE_ALTERNATE_TIMEOUT  -c    dtparserparse.c
    --- dependall-sbin ---
    --- ether.o ---
    #   compile  ifconfig/ether.o
    /tmp/bracket/build/2019. -O2   -fPIE    -std=gnu99    -Wall -Wstrict-prototypes -Wmissing-prototypes -Wpointer-arith -Wno-sign-compare  -Wsystem-headers   -Wno-traditional   -Wa,--fatal-warnings  -Wreturn-type -Wswitch -Wshadow -Wcast-qual -Wwrite-strings -Wextra -Wno-unused-parameter -Wno-sign-compare -Wold-style-definition -Wsign-compare -Wformat=2  -Wno-format-zero-length  -Werror     --sysroot=/tmp/bracket/build/2019. -I/tmp/bracket/build/2019. -DINET6 -DRUMP_ACTION -D_KERNTYPES  -c    /tmp/bracket/build/2019.
    --- dependall-games ---
    /tmp/bracket/build/2019. -t -g -L VERSION -o canfield canfield.o
    --- dependall-cfscores ---
    dependall ===> games/canfield/cfscores
    --- dependall-tests ---
    *** [t_subr_prf.o] Error code 1
    nbmake[7]: stopped in /tmp/bracket/build/2019.
    1 error

The following commits were made between the last successful build and
the failed build:

    2019. aymeric src/sys/arch/arm/altera/cycv_dwcmmc.c,v 1.2
    2019. aymeric src/sys/arch/arm/altera/cycv_platform.c,v 1.11
    2019. christos src/share/man/man9/kprintf.9,v 1.38
    2019. christos src/sys/kern/subr_prf.c,v 1.177
    2019. christos src/sys/sys/systm.h,v 1.285

Log files can be found at:

Home | Main Index | Thread Index | Old Index