tech-pkg archive

[Date Prev][Date Next][Thread Prev][Thread Next][Date Index][Thread Index][Old Index]

gnucash fails on Darwin


Given the enormous amount of dependencies for gnucash I would not have been surprised to see it fail somewhere along the line. But the build got all the way through and finally failed building gnucash itself like this...

/usr/bin/ld: Undefined symbols:
collect2: ld returned 1 exit status
gnumake[4]: *** [gnucash-bin] Error 1
gnumake[3]: *** [all-recursive] Error 1
gnumake[2]: *** [all-recursive] Error 1
gnumake[1]: *** [all-recursive] Error 1
gnumake: *** [all] Error 2
*** Error code 2

bmake: stopped in /usr/pkgsrc/finance/gnucash

This is Darwin 8.11.1 (aka Tiger, Mac OS 10.4.11). I'm also using pkgsrc-2007Q4.

Any help would be great. Thanks,


Home | Main Index | Thread Index | Old Index