pkgsrc-Users archive

[Date Prev][Date Next][Thread Prev][Thread Next][Date Index][Thread Index][Old Index]

"devel/protobuf" build fails on netbsd-9/i386

Building "devel/protobuf" on netbsd-9/i386 (up-to-date 9.2_STABLE) fails

gmake[2]: Entering directory '/tmp/pkgsrc/devel/protobuf/work/protobuf-3.20.1/src'
  CXX      google/protobuf/arenastring.lo
google/protobuf/ error: static assertion failed
 static_assert((kStringAlign > kNewAlign ? kStringAlign : kNewAlign) >= 8, "");
gmake[2]: *** [Makefile:4521: google/protobuf/arenastring.lo] Error 1
gmake[2]: Leaving directory '/tmp/pkgsrc/devel/protobuf/work/protobuf-3.20.1/src'
gmake[1]: *** [Makefile:1930: all-recursive] Error 1
gmake[1]: Leaving directory '/tmp/pkgsrc/devel/protobuf/work/protobuf-3.20.1'
gmake: *** [Makefile:1837: all] Error 2
*** Error code 2

make[1]: stopped in /x/pkgsrc/devel/protobuf
*** Error code 1

make: stopped in /x/pkgsrc/devel/protobuf

This was with pkgsrc-HEAD during the freeze.  Now that pkgsrc-2022Q2 has
been tagged, I'll update and try again, but I don't expect any change.

|/"\ John D. Baker, KN5UKS               NetBSD     Darwin/MacOS X
|\ / jdbaker[snail]consolidated[flyspeck]net  OpenBSD            FreeBSD
| X  No HTML/proprietary data in email.   BSD just sits there and works!
|/ \ GPGkeyID:  D703 4A7E 479F 63F8 D3F4  BD99 9572 8F23 E4AD 1645

Home | Main Index | Thread Index | Old Index