Subject: pkg/14972: japanese/groff fails to compile
To: None <>
From: None <>
List: netbsd-bugs
Date: 12/17/2001 11:29:19
>Number:         14972
>Category:       pkg
>Synopsis:       japanese/groff fails to compile
>Confidential:   no
>Severity:       serious
>Priority:       medium
>Responsible:    pkg-manager
>State:          open
>Class:          sw-bug
>Submitter-Id:   net
>Arrival-Date:   Sun Dec 16 18:30:00 PST 2001
>Originator:     Ryo HAYASAKA
>Release:        NetBSD 1.5Z, the latest pkgsrc tree
Japan Advanced Institute of Science and Technology (JAIST)
System: NetBSD 1.5Z NetBSD 1.5Z (BONNIE) #170: Fri Dec 14 17:22:42 JST 2001 i386
Architecture: i386
Machine: i386
I got the following error when compiling japanese/groff.

$ make install
gmake[2]: Entering directory `/c/pkgsrc/japanese/groff/work/groff-1.10/hpftodit'
In file included from
../include/lib.h: In function `int illegal_input_char(int)':
../include/lib.h:77: implicit declaration of function `int is_euc_byte(...)'
gmake[2]: *** [hpftodit.o] Error 1
gmake[2]: Leaving directory `/c/pkgsrc/japanese/groff/work/groff-1.10/hpftodit'
gmake[1]: *** [hpftodit] Error 2
gmake[1]: Leaving directory `/c/pkgsrc/japanese/groff/work/groff-1.10'
gmake: *** [all] Error 2
*** Error code 2

make: stopped in /c/pkgsrc/japanese/groff
*** Error code 1