Subject: pkg/14885: Package x11/kdelibs2 does not build
To: None <>
From: None <>
List: netbsd-bugs
Date: 12/09/2001 20:18:17
>Number:         14885
>Category:       pkg
>Synopsis:       Package x11/kdelibs2 does not build
>Confidential:   no
>Severity:       critical
>Priority:       high
>Responsible:    pkg-manager
>State:          open
>Class:          sw-bug
>Submitter-Id:   net
>Arrival-Date:   Sun Dec 09 17:19:00 PST 2001
>Originator:     John Klos
>Release:        NetBSD 1.5.1
Sixgirls Computing Labs
System: NetBSD 1.5.2 NetBSD 1.5.2 (GENERIC) #3: Sat Aug 18 23:37:05 CEST 2001 i386
Package x11/kdelibs2 does not build. pkgsrc has failed for KDE2 since last week of November on multiple machines.

I have tried updating libxml2-2.4.10; this changed nothing.

Failure here is:
cc -DHAVE_CONFIG_H -I. -I. -I../.. -I./.. -I/usr/pkgsrc/x11/kdelibs2/work/.build
link/include/libxml -I/usr/pkgsrc/x11/kdelibs2/work/.buildlink/include/libxml2 -
I/usr/pkgsrc/x11/kdelibs2/work/.buildlink/include -I/usr/pkgsrc/x11/kdelibs2/wor
k/.buildlink/include -I/usr/local/share/x11-links/include -I/usr/pkgsrc/x11/kdel
ibs2/work/.buildlink/include -O2 -I/usr/pkgsrc/x11/kdelibs2/work/.buildlink/incl
ude -O2 -i686 -I/usr/local/share/x11-links/include -c templates.c  -fPIC -DPIC -
o .libs/templates.o
In file included from /usr/pkgsrc/x11/kdelibs2/work/.buildlink/include/libxml/pa
                 from /usr/pkgsrc/x11/kdelibs2/work/.buildlink/include/libxml/xm
		 from templates.c:18:
/usr/pkgsrc/x11/kdelibs2/work/.buildlink/include/libxml/globals.h:70: syntax err
or before `xmlGenericErrorFunc'
/usr/pkgsrc/x11/kdelibs2/work/.buildlink/include/libxml/globals.h:217: syntax er
ror before `xmlGenericError'
/usr/pkgsrc/x11/kdelibs2/work/.buildlink/include/libxml/globals.h:217: warning:
data definition has no type or storage class
gmake[3]: *** [templates.lo] Error 1
gmake[3]: Leaving directory `/usr/pkgsrc/x11/kdelibs2/work/kdelibs-2.2.1/kdoctoo
gmake[2]: *** [all-recursive] Error 1
gmake[2]: Leaving directory `/usr/pkgsrc/x11/kdelibs2/work/kdelibs-2.2.1/kdoctoo
gmake[1]: *** [all-recursive] Error 1
gmake[1]: Leaving directory `/usr/pkgsrc/x11/kdelibs2/work/kdelibs-2.2.1'
gmake: *** [all-recursive-am] Error 2
*** Error code 2

*** Error code 1

	 cd /usr/pkgsrc/x11/kdelibs2 && make
	Not known.