Current-Users archive

[Date Prev][Date Next][Thread Prev][Thread Next][Date Index][Thread Index][Old Index]

Automated report: NetBSD-current/i386 build failure

This is an automatically generated notice of a NetBSD-current/i386
build failure.

The failure occurred on, a NetBSD/amd64 host,
using sources from CVS date 2016.

An extract from the output follows:

    i486--netbsdelf-gcc: error: /tmp/bracket/build/2016. No such file or directory
    --- dependall-usr.sbin ---
    #    create  btattach/btattach.d
    CC=/tmp/bracket/build/2016. /tmp/bracket/build/2016. -f btattach.d.tmp  --   -std=gnu99    -D_KERNTYPES --sysroot=/tmp/bracket/build/2016.      btattach.c &&  mv btattach.d.tmp btattach.d
    --- dependall-sys ---
    i486--netbsdelf-gcc: error: /tmp/bracket/build/2016. No such file or directory
    *** [boot] Error code 1
    nbmake[11]: stopped in /tmp/bracket/build/2016.
    1 error

The following commits were made between the last successful build and
the failed build:

    2016. christos src/usr.bin/make/main.c,v 1.252
    2016. christos src/usr.bin/make/make.h,v 1.102
    2016. christos src/usr.bin/make/parse.c,v 1.216
    2016. macallan src/sys/dev/pci/pm3fb.c,v 1.2

Log files can be found at:

Home | Main Index | Thread Index | Old Index