tech-pkg archive

[Date Prev][Date Next][Thread Prev][Thread Next][Date Index][Thread Index][Old Index]

error building lang/g95 on Darwin 12.4 / MacOS X 10.8


during update pkgsrc to recent -trunk, I encounter following error:

gcc -g -O2 -DIN_GCC -W -Wall -Wwrite-strings -Wstrict-prototypes -Wmissing-prototypes -pedantic -Wno-long-long -Wno-variadic-macros -Wold-style-definition -Wmissing-format-attribute -DHAVE_CONFIG_H -o cc1-dummy c-lang.o stub-objc.o attribs.o c-errors.o c-lex.o c-pragma.o c-decl.o c-typeck.o c-convert.o c-aux-info.o c-common.o c-opts.o c-format.o c-semantics.o c-incpath.o cppdefault.o c-ppoutput.o c-cppbuiltin.o prefix.o c-objc-common.o c-dump.o c-pch.o c-parser.o darwin-c.o c-gimplify.o tree-mudflap.o c-pretty-print.o dummy-checksum.o \ main.o libbackend.a ../libcpp/libcpp.a ../libcpp/libcpp.a ./../intl/libintl.a -L/opt/pkg/lib -liconv ../libiberty/libiberty.a
Undefined symbols for architecture x86_64:
  "_host_hooks", referenced from:
      _c_common_no_more_pch in c-pch.o
      _toplev_main in libbackend.a(toplev.o)
      _gt_pch_restore in libbackend.a(ggc-common.o)
      _gt_pch_save in libbackend.a(ggc-common.o)
ld: symbol(s) not found for architecture x86_64
collect2: ld returned 1 exit status
gnumake[2]: *** [cc1-dummy] Error 1
gnumake[1]: *** [all-gcc] Error 2
gnumake: *** [all] Error 2
*** Error code 2

bmake: stopped in /data/pkgsrc/lang/g95
WARNING: Please add USE_TOOLS+=perl to the package Makefile.
*** Error code 1

If anyone wants me trying something out, or has a hint how to fix
it quickly, I try what I can do quickly ...

Jens Rehsack
pkgsrc, Perl5

Home | Main Index | Thread Index | Old Index