Subject: problems building ms-ttf
To: None <>
From: Steven M. Bellovin <>
List: tech-pkg
Date: 08/08/2005 07:04:35
This is with up-to-the-minute pkgsrc from tree head, up-to-the-minute 
-current, and xorg.

 c++ -I/usr/pkgsrc/fonts/ttmkfdir2/work/.buildlink/include/freetype2 -O2 -I/usr/
pkgsrc/fonts/ttmkfdir2/work/.buildlink/include -c parser.cpp  -fPIC -DPIC -o .li
parser.cpp: In function `yy_buffer_state* yy_scan_bytes(const char*, int)':
parser.cpp:1682: error: invalid conversion from `const char*' to `char*'
parser.cpp:1682: error:   initializing argument 1 of `yy_buffer_state* 
   yy_scan_buffer(char*, unsigned int)'
gmake: *** [parser.o] Error 1
*** Error code 2

make: stopped in /usr/pkgsrc/fonts/ttmkfdir2
===> There was an error during the ``build'' phase.
===> Please investigate the following for more information:
===>      * log of the build
===>      * /usr/pkgsrc/fonts/ttmkfdir2/work/.work.log
*** Error code 1

		--Steven M. Bellovin,