Subject: www/gtkhtml3 fails.
To: None <>
From: Pritesh Shah <>
List: tech-pkg
Date: 06/20/2005 13:09:27
hi there,

i was trying to build the package www/gtkhtml3, but it fails with the
following error:

./.libs/ undefined reference to `_'
gmake[2]: *** [testgtkhtml] Error 1
gmake[2]: Leaving directory
gmake[1]: *** [all-recursive] Error 1
gmake[1]: Leaving directory
gmake: *** [all] Error 2
*** Error code 2

make: stopped in /home/psham/cvs/NetBSD/pkgsrc/www/gtkhtml3
=3D=3D=3D> There was an error during the ``build'' phase.
=3D=3D=3D> Please investigate the following for more information:
=3D=3D=3D>      * log of the build
=3D=3D=3D>      * /usr/tmp/pkgsrc/www/gtkhtml3/work.i386/.work.log
*** Error code 1

Could somebody please look into it and help me out.