Subject: sysutils/vcdimager-devel breakage
To: None <>
From: MLH <>
List: tech-pkg
Date: 10/06/2004 14:48:22
Appears that sysutils/vcdimager-devel broke with the lastest libtool
changes (this was while rebuilding all my pkgs in pkg_comp from
scratch yesterday):

if /bin/sh ../libtool --mode=compile gcc -DHAVE_CONFIG_H -I. -I. -I.. -I../include/ -I../lib/ -I/usr/pkg/include    -I/usr/pkg/include -I/usr/include  -O2 -I/usr/pkg/include -I/usr/include  -Wall -Wchar-subscripts -Wmissing-prototypes -Wmissing-declarations -Wunused -Wpointer-arith -Wwrite-strings -Wnested-externs -Wno-sign-compare -MT image.lo -MD -MP -MF ".deps/image.Tpo" -c -o image.lo image.c; \
then mv -f ".deps/image.Tpo" ".deps/image.Plo"; else rm -f ".deps/image.Tpo"; exit 1; fi
 gcc -DHAVE_CONFIG_H -I. -I.. -I../include/ -I../lib/ -I/pkg_comp/obj/pkgsrc/sysutils/vcdimager-devel/default/.buildlink/include -O2 -Wall -Wchar-subscripts -Wmissing-prototypes -Wmissing-declarations -Wunused -Wpointer-arith -Wwrite-strings -Wnested-externs -Wno-sign-compare -MT image.lo -MD -MP -MF .deps/image.Tpo -c image.c  -fPIC -DPIC -o .libs/image.o
image.c:80: error: conflicting types for `vcd_image_sink_write'
image_sink.h:67: error: previous declaration of `vcd_image_sink_write'
gmake[2]: *** [image.lo] Error 1
gmake[2]: Leaving directory `/pkg_comp/obj/pkgsrc/sysutils/vcdimager-devel/default/vcdimager-0.7.20/lib'
gmake[1]: *** [all-recursive] Error 1
gmake[1]: Leaving directory `/pkg_comp/obj/pkgsrc/sysutils/vcdimager-devel/default/vcdimager-0.7.20'
gmake: *** [all] Error 2
*** Error code 2

make: stopped in /usr/pkgsrc/sysutils/vcdimager-devel
*** Error code 1