Subject: Building sysutils/fam fails
To: None <>
From: Sylvester F <>
List: tech-pkg
Date: 03/27/2004 10:52:28

I have trouble building sysutils/fam:

g++ -shared -nostdlib /usr/lib/crtbeginS.o  .libs/Client.o .libs/fam.o  
-L/usr/pkg/gcc3/lib/gcc-lib/i386--netbsdelf/3.3.3/../../.. -lstdc++ -lm 
/usr/lib/crtendS.o  -Wl,-R/usr/pkg/gcc3/lib/gcc-lib/i386--netbsdelf/3.3.3 
-Wl,-R/usr/pkg/lib -Wl,-soname -Wl, -Wl,-retain-symbols-file 
-Wl,fam.sym -o .libs/
/usr/pkg/bin/ld: .libs/ undefined versioned symbol name 
/usr/pkg/bin/ld: failed to set dynamic section sizes: Bad value
collect2: ld returned 1 exit status
gmake[2]: *** [] Error 1
gmake[2]: Leaving directory 
gmake[1]: *** [all-recursive] Error 1
gmake[1]: Leaving directory `/mnt/uus/pkgsrc/sysutils/fam/work/fam-2.6.10'
gmake: *** [all] Error 2
*** Error code 2

I have i386, NetBSD 1.6.2 and i'm using gcc 3.3.3.  Any ideas what might be 
the problem?
Is anyone else having the same problem?

Help STOP SPAM with the new MSN 8 and get 2 months FREE*