Subject: Re: kdeadmin3 won't build under -current
To: Jukka Marin <>
From: Gavan Fantom <>
List: tech-pkg
Date: 12/17/2003 13:22:22
On Wed, 17 Dec 2003, Jukka Marin wrote:

> Trying to update kde3 on my laptop, lots (I mean _lots_!) of pkg's were
> deleted and while building the new ones, I ran into
> cthost.cpp: In constructor `CTHost::CTHost()':
> cthost.cpp:34: error: =ECfstream' undeclared (first use this function)
> cthost.cpp:34: error: (Each undeclared identifier is reported only once f=
>    each function it appears in.)
> cthost.cpp:34: error: parse error before `(' token
> cthost.cpp:42: error: =ECnputStream' undeclared (first use this function)
> gmake[2]: *** [cthost.o] Error 1
> gmake[2]: Leaving directory `/tmp/obj/misc/kdeadmin3/work/kdeadmin-3.1.4/=
> gmake[1]: *** [all-recursive] Error 1
> gmake[1]: Leaving directory `/tmp/obj/misc/kdeadmin3/work/kdeadmin-3.1.4'
> gmake: *** [all] Error 2
> *** Error code 2
> Stop.
> make: stopped in /work/src/pkgsrc/misc/kdeadmin3
> *** Error code 1
> I've been updating pkgsrc for several days now, but the Problem Won't Go =
> (TM).  I'm running 1.6ZE in case that matters.  I'd like to get kde3 goin=
> again, so what am I doing wrong?  Thanks!

For what it's worth, I'm running 1.6ZE and I built all of kde3 two days
ago without any problems.

Gillette - the best a man can forget