Subject: kdeadmin3 won't build under -current
To: pkgsrc <tech-pkg@NetBSD.ORG>
From: Jukka Marin <jmarin@embedtronics.fi>
List: tech-pkg
Date: 12/17/2003 15:16:09
Hi,

Trying to update kde3 on my laptop, lots (I mean _lots_!) of pkg's were
deleted and while building the new ones, I ran into

cthost.cpp: In constructor `CTHost::CTHost()':
cthost.cpp:34: error: žfstream' undeclared (first use this function)
cthost.cpp:34: error: (Each undeclared identifier is reported only once for 
   each function it appears in.)
cthost.cpp:34: error: parse error before `(' token
cthost.cpp:42: error: žnputStream' undeclared (first use this function)
gmake[2]: *** [cthost.o] Error 1
gmake[2]: Leaving directory `/tmp/obj/misc/kdeadmin3/work/kdeadmin-3.1.4/kcron'
gmake[1]: *** [all-recursive] Error 1
gmake[1]: Leaving directory `/tmp/obj/misc/kdeadmin3/work/kdeadmin-3.1.4'
gmake: *** [all] Error 2
*** Error code 2

Stop.
make: stopped in /work/src/pkgsrc/misc/kdeadmin3
*** Error code 1

I've been updating pkgsrc for several days now, but the Problem Won't Go Away
(TM).  I'm running 1.6ZE in case that matters.  I'd like to get kde3 going
again, so what am I doing wrong?  Thanks!

  -jm