Subject: Re: pkgsrc NetBSD 3.0_STABLE/i386 bulk build results 20061030.2123
To: None <>
From: Thomas Klausner <>
List: pkgsrc-bulk
Date: 11/05/2006 13:11:20
Diff to previous:
<          Build started:                  Fri Oct 27 18:33:05 2006 UTC
<          Build ended:                    Mon Oct 30 08:37:14 2006 UTC
>          Build started:                  Mon Oct 30 21:33:30 2006 UTC
>          Build ended:                    Thu Nov  2 08:29:44 2006 UTC
<          Successfully packaged:          5847
<          Packages really broken:         77
<          Pkgs broken due to them:        235
<          Total broken:                   312
<          Not packaged:                   87
<          Total:                          399
>          Successfully packaged:          6025
>          Packages really broken:         73
>          Pkgs broken due to them:        60
>          Total broken:                   133
>          Not packaged:                   88
>          Total:                          221
< graphics/openexr           175
> sysutils/xentools30        1

=> Checking for portability problems in extracted files
ERROR: [] => Found test ... == ...:
ERROR: [] examples/blktap: if [ "$command" == 'add' ]

Fixed, I think.

< chat/kadu                
> devel/aegis              

=> Checking for missing run-time search paths in aegis-4.22
=> Checking for work-directory references in aegis-4.22
ERROR: bin/ae-repo-ci:  Binary file bin/ae-repo-ci matches
ERROR: bin/aeannotate:  Binary file bin/aeannotate matches
ERROR: bin/aecomplete:  Binary file bin/aecomplete matches
ERROR: bin/aecvsserver: Binary file bin/aecvsserver matches
ERROR: bin/aede-policy: Binary file bin/aede-policy matches
ERROR: bin/aediff:      Binary file bin/aediff matches
ERROR: bin/aedist:      Binary file bin/aedist matches
ERROR: bin/aefind:      Binary file bin/aefind matches
ERROR: bin/aefinish:    Binary file bin/aefinish matches
ERROR: bin/aeget:       Binary file bin/aeget matches
ERROR: bin/aegis:       Binary file bin/aegis matches
ERROR: bin/aeimport:    Binary file bin/aeimport matches
ERROR: bin/aeintegratq: #!/tmp/bulktmp/devel/aegis/work/.tools/bin/perl
ERROR: bin/aelcf:       Binary file bin/aelcf matches
ERROR: bin/aelock:      Binary file bin/aelock matches
ERROR: bin/aelpf:       Binary file bin/aelpf matches
ERROR: bin/aels:        Binary file bin/aels matches
ERROR: bin/aepatch:     Binary file bin/aepatch matches
ERROR: bin/aepromptcmd: Binary file bin/aepromptcmd matches
ERROR: bin/aerect:      Binary file bin/aerect matches
ERROR: bin/aereport:    Binary file bin/aereport matches
ERROR: bin/aerevml:     Binary file bin/aerevml matches
ERROR: bin/aesub:       Binary file bin/aesub matches
ERROR: bin/aesubunit:   Binary file bin/aesubunit matches
ERROR: bin/aesvt:       Binary file bin/aesvt matches
ERROR: bin/aetar:       Binary file bin/aetar matches
ERROR: bin/aexml:       Binary file bin/aexml matches
ERROR: *** The above files still have references to the build directory.
ERROR:     This is possibly an error that should be fixed by unwrapping
ERROR:     the files or adding missing tools to the package makefile!
*** Error code 1

< games/nethack            
< graphics/openexr           175
< graphics/ruby-RMagick    
> graphics/pixieplus       

In file included from /tmp/bulktmp/graphics/pixieplus/work/.buildlink/include/magick/MagickCore.h:163,
                 from /tmp/bulktmp/graphics/pixieplus/work/.buildlink/include/magick/api.h:28,
                 from batch.h:19,
                 from batch.cpp:1:
/tmp/bulktmp/graphics/pixieplus/work/.buildlink/include/magick/option.h:82: error: comma
   at end of enumerator list
batch.cpp: In constructor `KIFSineWaveDialog::KIFSineWaveDialog(QWidget*, const
batch.cpp:183: warning: `__comp_ctor' is deprecated (declared at
batch.cpp:186: warning: `__comp_ctor' is deprecated (declared at
batch.cpp: In constructor `KIFShadeDialog::KIFShadeDialog(QWidget*, const
batch.cpp:210: warning: `__comp_ctor' is deprecated (declared at
batch.cpp:213: warning: `__comp_ctor' is deprecated (declared at
gmake[2]: *** [batch.lo] Error 1
gmake[2]: Leaving directory `/tmp/bulktmp/graphics/pixieplus/work/pixieplus-0.5.4/app'
gmake[1]: *** [all-recursive] Error 1

< security/amap            
< x11/xplanet