Subject: Re: pkgsrc Darwin 8.7.0/powerpc bulk build results 20060819.1358
To: None <pkgsrc-bulk@NetBSD.org>
From: Thomas Klausner <wiz@NetBSD.org>
List: pkgsrc-bulk
Date: 08/27/2006 11:07:04
Diff to previous:
7,8c7,8
<          Build started:                  Wed Aug  9 22:04:06 2006 UTC
<          Build ended:                    Sat Aug 19 03:34:24 2006 UTC
---
>          Build started:                  Sat Aug 19 12:12:05 2006 UTC
>          Build ended:                    Sat Aug 26 15:44:51 2006 UTC
10,15c10,15
<          Successfully packaged:          4127
<          Packages really broken:         925
<          Pkgs broken due to them:        723
<          Total broken:                   1648
<          Not packaged:                   407
<          Total:                          2055
---
>          Successfully packaged:          4132
>          Packages really broken:         926
>          Pkgs broken due to them:        739
>          Total broken:                   1665
>          Not packaged:                   408
>          Total:                          2073
20c20
< ftp://ftp.NetBSD.org/pub/pkgsrc/misc/kristerw/pkgstat/Darwin-powerpc/20060809.2335/report.html
---
> ftp://ftp.NetBSD.org/pub/pkgsrc/misc/kristerw/pkgstat/Darwin-powerpc/20060819.1358/report.html
101c101
< audio/sox                  6       pkgsrc-users@NetBSD.org
---
> audio/sox                  7       pkgsrc-users@NetBSD.org
102a103
> audio/streamtuner                  pkgsrc-users@NetBSD.org

=> Applying pkgsrc patches for streamtuner-0.99.99nb4
===> Creating toolchain wrappers for streamtuner-0.99.99nb4
ERROR: libidn is not installed; can't buildlink files.

192d192
< databases/lua-sqlite               pancake@phreaker.net
223d222
< devel/cook                 1       groo@NetBSD.org
230a230
> devel/equeue               3       pkgsrc-users@NetBSD.org

ocamlfind: ocamlopt does not support multi-threaded programs for your configuration

346d345
< games/fillets-ng                   salo@NetBSD.org
371d369
< games/openttd                      froz@icix.org
378d375
< games/stratagus            1       pkgsrc-users@NetBSD.org
421d417
< graphics/gthumb                    minskim@NetBSD.org
444d439
< graphics/ruby-RMagick              obata@lins.jp
491a487
> lang/lua                   11      pkgsrc-users@NetBSD.org

gcc -pipe -dynamiclib ${wl}-flat_namespace ${wl}-undefined ${wl}suppress -o .libs/liblua.5.0.1.dylib  .libs/lapi.o .libs/lcode.o .libs/ldebug.o .libs/ldo.o .libs/ldump.o .libs/lfunc.o .libs/lgc.o .libs/llex.o .libs/lmem.o .libs/lobject.o .libs/lopcodes.o .libs/lparser.o .libs/lstate.o .libs/lstring.o .libs/ltable.o .libs/ltm.o .libs/lundump.o .libs/lvm.o .libs/lzio.o .libs/lauxlib.o .libs/lbaselib.o .libs/ldblib.o .libs/liolib.o .libs/lmathlib.o .libs/loslib.o .libs/ltablib.o .libs/lstrlib.o .libs/loadlib.o .libs/linit.o  -L/tmp/bulktmp/lang/lua/work/.buildlink/lib -lm /tmp/bulktmp/lang/lua/work/.buildlink/lib/libreadline.dylib /tmp/bulktmp/lang/lua/work/.buildlink/lib/libhistory.dylib -lncurses  -Wl,-E -install_name  /usr/pkg/lib/liblua.5.dylib -Wl,-compatibility_version -Wl,6 -Wl,-current_version -Wl,6.1
/usr/bin/libtool: unknown option character `E' in: -E
Usage: /usr/bin/libtool -static [-] file [...] [-filelist listfile[,dirname]] [-arch_only arch] [-sacLT]
Usage: /usr/bin/libtool -dynamic [-] file [...] [-filelist listfile[,dirname]] [-arch_only arch] [-o output] [-install_name name] [-compatibility_version #] [-current_version #] [-seg1addr 0x#] [-segs_read_only_addr 0x#] [-segs_read_write_addr 0x#] [-seg_addr_table <filename>] [-seg_addr_table_filename <file_system_path>] [-all_load] [-noall_load]

521d516
< mail/dovecot                       ghen@NetBSD.org
526a522
> mail/ja-squirrelmail               martti@NetBSD.org

ERROR: ************************************************************
ERROR: The following files are in the PLIST but not in /usr/pkg:
ERROR:         /usr/pkg/share/squirrelmail/doc/Development/addressbook.txt
ERROR:         /usr/pkg/share/squirrelmail/doc/Development/index.html
ERROR:         /usr/pkg/share/squirrelmail/doc/Development/mime.txt
ERROR:         /usr/pkg/share/squirrelmail/doc/Development/plugin.txt
ERROR:         /usr/pkg/share/squirrelmail/doc/Development/rfc_documents.txt
ERROR:         /usr/pkg/share/squirrelmail/doc/Development/tree.txt
ERROR:         /usr/pkg/share/squirrelmail/po/charsetconvert.pl
ERROR: ************************************************************
ERROR: The following files are in /usr/pkg but not in the PLIST:
ERROR:         /usr/pkg/share/squirrelmail/contrib/conf.pl.8
ERROR:         /usr/pkg/share/squirrelmail/doc/ReleaseNotes/1.4/Notes-1.4.7.txt

535d530
< mail/mutt-devel                    tonio@NetBSD.org
616c611
< multimedia/ming            3       pkgsrc-users@NetBSD.org
---
> multimedia/ming            4       pkgsrc-users@NetBSD.org
686a682
> net/php-snmp               2       jdolecek@NetBSD.org

configure: error: SNMP sanity check failed. Please check config.log for more information.

691a688
> net/powerdns-pgsql                 ghen@NetBSD.org

g++ -dynamiclib -single_module ${wl}-flat_namespace ${wl}-undefined ${wl}suppress -o .libs/libgpgsqlbackend.0.0.0.dylib  .libs/gpgsqlbackend.o .libs/spgsql.o  -L/tmp/bulktmp/net/powerdns-pgsql/work/.buildlink/lib /tmp/bulktmp/net/powerdns-pgsql/work/.buildlink/lib/libpq.dylib /tmp/bulktmp/net/powerdns-pgsql/work/.buildlink/lib/libintl.dylib -lssl -lcrypt -lcrypto -lz  -pthread -pthread -Wl,-Bstatic -Wl,-Bdynamic -install_name  /usr/pkg/lib/pdns/libgpgsqlbackend.0.dylib -Wl,-compatibility_version -Wl,1 -Wl,-current_version -Wl,1.0
powerpc-apple-darwin8-g++-4.0.1: unrecognized option '-pthread'
powerpc-apple-darwin8-g++-4.0.1: unrecognized option '-pthread'
/usr/bin/libtool: unknown option character `B' in: -Bstatic
Usage: /usr/bin/libtool -static [-] file [...] [-filelist listfile[,dirname]] [-arch_only arch] [-sacLT]
Usage: /usr/bin/libtool -dynamic [-] file [...] [-filelist listfile[,dirname]] [-arch_only arch] [-o output] [-install_name name] [-compatibility_version #] [-current_version #] [-seg1addr 0x#] [-segs_read_only_addr 0x#] [-segs_read_write_addr 0x#] [-seg_addr_table <filename>] [-seg_addr_table_filename <file_system_path>] [-all_load] [-noall_load]
gnumake[1]: *** [libgpgsqlbackend.la] Error 1
gnumake: *** [all-recursive] Error 1

709a707
> net/synergy                        yui@yui.pe.kr

ERROR: The following files are in /usr/pkg but not in the PLIST:
ERROR:         /usr/pkg/share/examples/synergy/synergy.conf

745a744,745
> pkgtools/bootstrap-extras          pkgsrc-users@NetBSD.org

Fixed.

> pkgtools/bootstrap-mk-files         pkgsrc-users@NetBSD.org

Fixed.

747d746
< print/dvipng                       pkgsrc-users@NetBSD.org
793c792
< security/steghide                  adam@monkeybyte.org
---
> security/steghide                  pkgsrc-users@NetBSD.org
860d858
< textproc/lua-expat                 pancake@phreaker.net
865a864
> textproc/raptor                    pkgsrc-users@NetBSD.org

===> Creating toolchain wrappers for raptor-1.4.10
ERROR: libidn is not installed; can't buildlink files.

884d882
< wm/ion3-devel                      rpaulo@NetBSD.org
903a902
> www/ap2-auth-xradius               adrianp@NetBSD.org

libradius/radlib.c:64: error: static declaration of 'strsep' follows non-static declaration
/usr/include/string.h:129: error: previous declaration of 'strsep' was here
libradius/radlib.c: In function 'xrad_continue_send_request':
libradius/radlib.c:550: warning: pointer targets in passing argument 6 of 'recvfrom' differ in signedness

909c908
< www/firefox                12      taya@NetBSD.org
---
> www/firefox                13      taya@NetBSD.org
918a918,919
> www/p5-WWW-Curl                    imil@gcu.info

Curl.xs: In function 'perl_curl_form_delete':
Curl.xs:199: warning: passing argument 1 of 'curl_formfree' from incompatible pointer type
In file included from Curl.xs:495:
curlopt-constants.c: In function 'constant':
curlopt-constants.c:15: error: 'CURLINFO_COOKIELIST' undeclared (first use in this function)
curlopt-constants.c:15: error: (Each undeclared identifier is reported only once
curlopt-constants.c:15: error: for each function it appears in.)
...

> www/php-curl               2       jdolecek@NetBSD.org

===> Creating toolchain wrappers for php5-curl-5.1.4
ERROR: libidn is not installed; can't buildlink files.

922d922
< www/screws                         pancake@phreaker.net
928a929
> www/zope29                         pkgsrc-users@NetBSD.org

===> Configuring for zope-2.9.4

Using Python interpreter at /usr/pkg/bin/python2.4

Configuring Zope installation


The Python interpreter you are using does not appear to have the 'pyexpat'
library module installed.  For many Zope features to work properly, including
Zope Page Templates, you must install a Python interpreter which includes the
pyexpat module, or install the pyexpat library into your Python interpreter
manually.  The file which represents the library is named 'pyexpat.so' (UNIX)
or 'pyexpat.dll' (Windows) and is typically located in the 'lib-dynload'
directory of your Python's library directory.  Some Python packagers ship the
pyexpat module as a separate installable binary. If you are using a
system-provided Python installation, you may want to look for a 'python-xml'
or 'python-pyexpat' package (or something like it) and install it to make the
pyexpat module available to Zope.  If you've compiled your Python interpreter
from source, you may need to recompile and reinstall it after installing James
Clark's expat libraries and development packages (look for libexpat.so and
expat.h). Typically, these come as part of your operating system's libexpat
and libexpat-dev packages, respectively.

Run the configure script with the --ignore-expat option to prevent this
warning with the understanding that some Zope features may not work properly
until you've installed the pyexpat module.

*** Error code 1

 Thomas