pkgsrc-Bugs archive

[Date Prev][Date Next][Thread Prev][Thread Next][Date Index][Thread Index][Old Index]

pkg/48103: multimedia/gstreamer0.10 fails to build on NetBSD-6.1/amd64

>Number:         48103
>Category:       pkg
>Synopsis:       multimedia/gstreamer0.10 fails to build on NetBSD-6.1/amd64
>Confidential:   no
>Severity:       serious
>Priority:       medium
>Responsible:    pkg-manager
>State:          open
>Class:          sw-bug
>Submitter-Id:   net
>Arrival-Date:   Thu Aug 01 20:30:00 +0000 2013
>Originator:     Greg Oster
>Release:        NetBSD 6.1
System: NetBSD mickey 6.1 NetBSD 6.1 (QUAD) #0: Sun May 12 20:43:01 CST 2013 
Architecture: x86_64
Machine: amd64

multimedia/gstreamer0.10 fails to build on NetBSD-6.1/amd64 with the 
following errors:

Making all in gst
gmake[2]: Entering directory 
  GEN    gstenumtypes.h
  GEN    gstmarshal.h
  GEN    gstenumtypes.c
  GEN    gstmarshal.c
/usr/pkg/bin/gmake  all-recursive
gmake[3]: Entering directory 
Making all in parse
gmake[4]: Entering directory 
  GEN    lex.priv_gst_parse_yy.c
  CC     libgstparse_la-lex.priv_gst_parse_yy.lo
./grammar.y: warning: 37 shift/reduce conflicts [-Wconflicts-sr]
./grammar.y: warning: 5 reduce/reduce conflicts [-Wconflicts-rr]
  CC In function 'priv_gst_parse_yyparse': error: too few arguments to function 
./grammar.y:39:5: note: declared here
gmake[4]: *** [] Error 1
gmake[4]: Leaving directory 
gmake[3]: *** [all-recursive] Error 1
gmake[3]: Leaving directory 
gmake[2]: *** [all] Error 2
gmake[2]: Leaving directory 
gmake[1]: *** [all-recursive] Error 1
gmake[1]: Leaving directory 
gmake: *** [all] Error 2
*** Error code 2

make: stopped in /usr/pkgsrc/multimedia/gstreamer0.10
*** Error code 1



        cd /usr/pkgsrc/multimedia/gstreamer0.10
        make install package clean

        Please.  Thanks.

Home | Main Index | Thread Index | Old Index