pkgsrc-Bugs archive

[Date Prev][Date Next][Thread Prev][Thread Next][Date Index][Thread Index][Old Index]

pkg/43980: libwine not found while building wine

>Number:         43980
>Category:       pkg
>Synopsis:       libwine not found while building wine
>Confidential:   no
>Severity:       critical
>Priority:       low
>Responsible:    pkg-manager
>State:          open
>Class:          sw-bug
>Submitter-Id:   net
>Arrival-Date:   Sun Oct 17 17:35:00 +0000 2010
>Originator:     Stefan
>Release:        slackware 13
shared library libwine is not found while building emulators/wine (I'm running 
slackware 13 with pkgsrc-current).

make[1]: Entering directory `/tmp/current/emulators/wine/work/wine-1.0.1/fonts'
../tools/sfnt2fnt -o coue1255.fon -d 128 ./courier.ttf 13,1255,8
../tools/sfnt2fnt: error while loading shared libraries: cannot 
open shared object file: No such file or directory
make[1]: *** [coue1255.fon] Error 127
make[1]: Leaving directory `/tmp/current/emulators/wine/work/wine-1.0.1/fonts'
make: *** [fonts] Error 2
*** Error code 2

Libwine is available in the work directory, though:

# find /|grep libwine



Home | Main Index | Thread Index | Old Index