pkgsrc-Bugs archive

[Date Prev][Date Next][Thread Prev][Thread Next][Date Index][Thread Index][Old Index]

Re: pkg/41601 (devel/glib2 fails to compile on Solaris 10)

The following reply was made to PR pkg/41601; it has been noted by GNATS.

From: kordex - <>
Subject: Re: pkg/41601 (devel/glib2 fails to compile on Solaris 10)
Date: Sun, 21 Feb 2010 16:12:10 +0200

 Making all in tests
 gmake[4]: Entering directory
 gcc -DHAVE_CONFIG_H -I. -I../.. -g -I../.. -I../../glib
 -DG_DISABLE_CAST_CHECKS  -DPREFIX="\"/export/home/kordex/pkg\""
 -I/export/home/kordex/pkg/include -I/usr/include
 -I/export/home/kordex/pkg/include -I/usr/include -Wall -MT strfuncs.o
 -MD -MP -MF .deps/strfuncs.Tpo -c -o strfuncs.o strfuncs.c
 strfuncs.c: In function `check_strtod_string':
 strfuncs.c:877: warning: implicit declaration of function `__builtin_isnan'
 strfuncs.c: In function `test_strtod':
 strfuncs.c:924: error: incompatible types in assignment
 strfuncs.c:932: error: `__builtin_infinity' undeclared (first use in
 this function)
 strfuncs.c:932: error: (Each undeclared identifier is reported only once
 strfuncs.c:932: error: for each function it appears in.)
 gmake[4]: *** [strfuncs.o] Error 1
 gmake[4]: Leaving directory
 gmake[3]: *** [all-recursive] Error 1
 gmake[3]: Leaving directory
 gmake[2]: *** [all] Error 2
 gmake[2]: Leaving directory
 gmake[1]: *** [all-recursive] Error 1
 gmake[1]: Leaving directory
 gmake: *** [all] Error 2
 *** Error code 2
 bmake: stopped in /export/home/kordex/pkgsrc/devel/glib2
 *** Error code 1
 bmake: stopped in /export/home/kordex/pkgsrc/devel/glib2
 SunOS flexnet 5.10 Generic sun4u sparc SUNW,Netra-T4
 In current today.

Home | Main Index | Thread Index | Old Index