pkgsrc-Bugs archive

[Date Prev][Date Next][Thread Prev][Thread Next][Date Index][Thread Index][Old Index]

pkg/41984: security/libprelude compilation errors (NetBSD 4.0 / i386)

>Number:         41984
>Category:       pkg
>Synopsis:       security/libprelude compilation errors (NetBSD 4.0 / i386)
>Confidential:   no
>Severity:       serious
>Priority:       medium
>Responsible:    pkg-manager
>State:          open
>Class:          sw-bug
>Submitter-Id:   net
>Arrival-Date:   Thu Sep 03 14:15:05 +0000 2009
>Originator:     Robert Elz
>Release:        NetBSD 4.0 / i386     pkgsrc -current
        Prince of Songkla University
System: NetBSD 4.0_STABLE NetBSD 4.0_STABLE 
(JADE-1.696-20080517) #9: Fri May 23 18:55:13 ICT 2008 i386
Architecture: i386
Machine: i386
        security/libprelude (libprelude-0.9.24) fails to compile on
        NetBSD 4.0 (i386).

        I use pkg_comp with libkver and NetBSD 4.0 release sets installed
        (except the x* sets, I use pkgsrc modular xorg instead).

        With that environment, building security/libprelude results in ...

/bin/sh ../../libtool  --tag=CXX   --mode=compile c++ -DHAVE_CONFIG_H -I. 
-I../..  -I../.. -I../../src/include -I../../src/include 
-I../../src/libprelude-error -I../../bindings/c++/include 
-I../../bindings/c++/include  -I/usr/pkg/include -I/usr/include  -O2 
-I/usr/pkg/include -I/usr/include -MT libpreludecpp_la-prelude.lo -MD -MP -MF 
.deps/libpreludecpp_la-prelude.Tpo -c -o libpreludecpp_la-prelude.lo `test -f 
'prelude.cxx' || echo './'`prelude.cxx
 c++ -DHAVE_CONFIG_H -I. -I../.. -I../../src/include 
-I../../src/libprelude-error -I../../bindings/c++/include 
-I/pkg_comp/obj/pkgsrc/security/libprelude/4x/.buildlink/include -O2 -MT 
libpreludecpp_la-prelude.lo -MD -MP -MF .deps/libpreludecpp_la-prelude.Tpo -c 
prelude.cxx  -fPIC -DPIC -o .libs/libpreludecpp_la-prelude.o
/usr/include/g++/ctime:73: error: '::mktime' has not been declared
gmake[4]: *** [libpreludecpp_la-prelude.lo] Error 1
gmake[4]: Leaving directory 
gmake[3]: *** [all-recursive] Error 1
gmake[3]: Leaving directory 
gmake[2]: *** [all-recursive] Error 1
gmake[2]: Leaving directory 
gmake[1]: *** [all-recursive] Error 1
gmake[1]: Leaving directory 
gmake: *** [all] Error 2
*** Error code 2

make: stopped in /usr/pkgsrc/security/libprelude
*** Error code 1



Home | Main Index | Thread Index | Old Index