pkgsrc-Bugs archive

[Date Prev][Date Next][Thread Prev][Thread Next][Date Index][Thread Index][Old Index]

pkg/41399: Pkgsrc: print/lilypond build error

>Number:         41399
>Category:       pkg
>Synopsis:       Pkgsrc: print/lilypond build error
>Confidential:   no
>Severity:       serious
>Priority:       medium
>Responsible:    pkg-manager
>State:          open
>Class:          sw-bug
>Submitter-Id:   net
>Arrival-Date:   Sat May 09 20:40:00 +0000 2009
>Originator:     Christopher Berardi
>Release:        NetBSD 5.0
NetBSD 5.0 NetBSD 5.0 (GENERIC) #0: Sun Apr 26 18:50:08 
UTC 2009

When building print/lilypond, the build process exits due to an error. I've 
also experienced this bug with past versions of pkgsrc. Here is where and what 
the error states:

 "pt->read_pos == pt->read_end" failed: file "ports.c", line 978, function 
[1]   Abort trap (core dumped) /usr/pkgsrc/prin...
gmake[2]: *** [out/lilypond-internals.texi] Error 134
gmake[2]: Leaving directory 
gmake[1]: *** [all] Error 2
gmake[1]: Leaving directory 
gmake: *** [all] Error 2
*** Error code 2

make: stopped in /usr/pkgsrc/print/lilypond
*** Error code 1

make: stopped in /usr/pkgsrc/print/lilypond

# cd /usr/pkgsrc/print/lilypond
# make

Home | Main Index | Thread Index | Old Index