pkgsrc-Bugs archive

[Date Prev][Date Next][Thread Prev][Thread Next][Date Index][Thread Index][Old Index]

pkg/40768: graphics/evas-software-x11 doesnt build

>Number:         40768
>Category:       pkg
>Synopsis:       graphics/evas-software-x11 doesnt build
>Confidential:   no
>Severity:       non-critical
>Priority:       low
>Responsible:    pkg-manager
>State:          open
>Class:          change-request
>Submitter-Id:   net
>Arrival-Date:   Fri Feb 27 14:50:00 +0000 2009
>Originator:     Pierre ALLEGRAUD
>Release:        NetBSD NetBSD 5.99.7 (GENERIC) amd64
NetBSD 5.99.7 NetBSD 5.99.7 (GENERIC) #1: Tue Feb 24 
17:00:28 CET 2009
I'm using pkgsrc modular xorg.

graphics/evas-software-x11 and graphics/evas-xrender-x11 dont build :

===> Building for evas-software-x11-
if /bin/sh ../../../../libtool --tag=CC --mode=compile cc -DHAVE_CONFIG_H -I. 
-I. -I../../../..  -I. -I../../../../src/lib -I../../../../src/lib/include 
-I../../../../src/modules/engines -I/usr/pkg/include/freetype2 
-I/usr/pkg/include -I/usr/X11R6/include -I/usr/pkg/include -I/usr/include 
-I/usr/pkg/include/freetype2 -O2 -march=nocona -I/usr/pkg/include 
-I/usr/include -I/usr/pkg/incl
ude/freetype2 -MT evas_engine.lo -MD -MP -MF ".deps/evas_engine.Tpo" -c -o 
evas_engine.lo evas_engine.c; \
        then mv -f ".deps/evas_engine.Tpo" ".deps/evas_engine.Plo"; else rm -f 
".deps/evas_engine.Tpo"; exit 1; fi
mkdir .libs
 cc -DHAVE_CONFIG_H -I. -I../../../.. -I../../../../src/lib -I../../../../src/li
b/include -I../../../../src/modules/engines 
-I/usr/obj/pkg/obj/graphics/evas-software-x11/work/.buildlink/include -O2 
-march=nocona -MT evas_engine
.lo -MD -MP -MF .deps/evas_engine.Tpo -c evas_engine.c  -fPIC -DPIC -o 
In file included from evas_engine.c:3:
evas_engine.h:7:33: error: X11/extensions/XShm.h: No such file or directory
In file included from evas_engine.c:3:
evas_engine.h:81: error: expected specifier-qualifier-list before 'XShmSegmentIn
gmake: *** [evas_engine.lo] Error 1
*** Error code 2

make: stopped in /usr/pkgsrc/graphics/evas-software-x11
*** Error code 1

make: stopped in /usr/pkgsrc/graphics/evas-software-x11
cd /usr/pkgsrc/graphics/evas-software-x11 && make
.include "../../x11/xextproto/"
into Makefiles of evas-xrender-x11 and evas-software-x11.

Home | Main Index | Thread Index | Old Index