pkgsrc-Bugs archive

[Date Prev][Date Next][Thread Prev][Thread Next][Date Index][Thread Index][Old Index]

pkg/40263: multimedia/vlc08 compile errors (NetBSD 4.0, modular xorg)

>Number:         40263
>Category:       pkg
>Synopsis:       multimedia/vlc08 compile errors (NetBSD 4.0, modular xorg)
>Confidential:   no
>Severity:       non-critical
>Priority:       low
>Responsible:    pkg-manager
>State:          open
>Class:          sw-bug
>Submitter-Id:   net
>Arrival-Date:   Wed Dec 24 16:10:00 +0000 2008
>Originator:     Robert Elz
>Release:        NetBSD 4.0_STABLE   (pkgsrc current within past 6 hours)
        Prince of Songkla University
System: NetBSD 4.0_STABLE NetBSD 4.0_STABLE 
(JADE-1.696-20080517) #9: Fri May 23 18:55:13 ICT 2008 i386
Architecture: i386
Machine: i386
        multimedia/vlc08 generates compile errors on NetBSD 4
        (with modular xorg from pkgsrc, but that is probably irrelevant).

        I use pkg_comp with libkver and NetBSD 4.0 release sets (except x*)
        to get a 4.0 environment.

        Building multimedia/vlc08 results in ...

/bin/sh ../../libtool --tag=CC --mode=link cc -Wsign-compare -Wall -O2 
-I/usr/pkg/include -I/usr/pkg/include/faad2 -I/usr/include 
-I/usr/pkg/include/SDL -I/usr/pkg/include/freetype2 -pthread -pipe 
-L/usr/pkg/lib -Wl,-R/usr/pkg/lib -L/usr/lib -Wl,-R/usr/lib -o libtelx_plugin.a -L/usr/pkg/lib -shared -lpthread -fpic -fPIC 
-u vlc_entry__0_8_6
cc -Wsign-compare -Wall -O2 
-pthread -pipe -Wl,-R/usr/pkg/lib -o -shared -fpic -fPIC -u 
vlc_entry__0_8_6  -L/pkg_comp/obj/pkgsrc/multimedia/vlc08/4x/.buildlink/lib 
libtelx_plugin.a -lpthread  
if cc -DHAVE_CONFIG_H -I. -I. -I../..   -I/usr/pkg/include 
-I/usr/pkg/include/faad2 -I/usr/include -I/usr/pkg/include/SDL 
-I/usr/pkg/include/freetype2 -DSYS_NETBSDELF -I../../include 
`top_builddir="../.." ../../vlc-config --cflags plugin x264` -Wsign-compare 
-Wall -O2 -I/usr/pkg/include -I/usr/pkg/include/faad2 -I/usr/include 
-I/usr/pkg/include/SDL -I/usr/pkg/include/freetype2 -pthread -pipe -MT 
libx264_plugin_a-x264.o -MD -MP -MF ".deps/libx264_plugin_a-x264.Tpo" -c -o 
libx264_plugin_a-x264.o `test -f 'x264.c' || echo './'`x264.c; \
        then mv -f ".deps/libx264_plugin_a-x264.Tpo" 
".deps/libx264_plugin_a-x264.Po"; else rm -f ".deps/libx264_plugin_a-x264.Tpo"; 
exit 1; fi
In file included from x264.c:32:
warning: #warning You must include stdint.h or inttypes.h before x264.h
x264.c: In function 'Open':
x264.c:893: error: 'x264_param_t' has no member named 'b_bframe_adaptive'
x264.c:935: error: 'struct <anonymous>' has no member named 'b_bframe_rdo'
x264.c:945: error: 'struct <anonymous>' has no member named 'b_bidir_me'
gmake[4]: *** [libx264_plugin_a-x264.o] Error 1
gmake[4]: Leaving directory 
gmake[3]: *** [all-modules] Error 1
gmake[3]: Leaving directory 
gmake[2]: *** [all-recursive] Error 1
gmake[2]: Leaving directory 
gmake[1]: *** [all-recursive] Error 1
gmake[1]: Leaving directory 
gmake: *** [all] Error 2
*** Error code 2



Home | Main Index | Thread Index | Old Index