pkgsrc-Bugs archive

[Date Prev][Date Next][Thread Prev][Thread Next][Date Index][Thread Index][Old Index]

pkg/40211: x11/gnustep-preferences compilation error (NetBSD 4.0 pkgsrc modular xorg)

>Number:         40211
>Category:       pkg
>Synopsis:       x11/gnustep-preferences compilation error (NetBSD 4.0 pkgsrc 
>modular xo
>Confidential:   no
>Severity:       non-critical
>Priority:       low
>Responsible:    pkg-manager
>State:          open
>Class:          sw-bug
>Submitter-Id:   net
>Arrival-Date:   Wed Dec 17 17:20:00 +0000 2008
>Originator:     Robert Elz
>Release:        NetBSD 4.0_STABLE  (pkgsrc current within past 10 hours)
        Prince of Songkla University
System: NetBSD 4.0_STABLE NetBSD 4.0_STABLE 
(JADE-1.696-20080517) #9: Fri May 23 18:55:13 ICT 2008 i386
Architecture: i386
Machine: i386
        Building x11/gnustep-preferences dies with a compilation error.

        I use pkg_comp with libkver and NetBSD 4.0 sets installed (except
        not the X sets) and X11_TYPE=modular in (the sandbox) mk.conf
        Quite likely none of that is relevant.

        Building using pkg_comp (pkg_comp build x11/gnustep-preferences)
        fails as ...

Making all in Modules/PrefsApp...
gmake[1]: Entering directory 
Making all for bundle PrefsApp...
 Creating PrefsApp.prefs/....
 Compiling file PrefsAppView.m ...
 Compiling file PrefsApp.m ...
cc1obj: warnings being treated as errors
PrefsApp.m: In function 'getBoolDefault':
PrefsApp.m:98: warning: no '-nextObject' method found
PrefsApp.m:98: warning: (Messages without a matching method signature
PrefsApp.m:98: warning: will be assumed to return 'id' and accept
PrefsApp.m:98: warning: '...' as arguments.)
gmake[2]: *** [obj/PrefsApp.o] Error 1
gmake[1]: *** [PrefsApp.all.bundle.variables] Error 2
gmake[1]: Leaving directory 
gmake: *** [internal-all] Error 2
*** Error code 2

make: stopped in /usr/pkgsrc/x11/gnustep-preferences
*** Error code 1




Home | Main Index | Thread Index | Old Index