pkgsrc-Bugs archive

[Date Prev][Date Next][Thread Prev][Thread Next][Date Index][Thread Index][Old Index]

pkg/37902: devel/autogen shell script syntax error ??

>Number:         37902
>Category:       pkg
>Synopsis:       devel/autogen shell script syntax error ??
>Confidential:   no
>Severity:       non-critical
>Priority:       low
>Responsible:    pkg-manager
>State:          open
>Class:          sw-bug
>Submitter-Id:   net
>Arrival-Date:   Tue Jan 29 14:50:00 +0000 2008
>Originator:     Robert Elz
>Release:        NetBSD 3.99.15   (pkgsrc current within past 8 hours)
        Prince of Songkla University
System: NetBSD 3.99.15 NetBSD 3.99.15 
(GENERIC-1.696-20060125) #8: Wed Jan 25 04:59:39 ICT 2006 i386
Architecture: i386
Machine: i386
        devel/autogen aborts with an apparent syntax error in a
        script when attempting to make a binary package

        I'm using pkg_comp with libkver and NetBSD 3.0 release sets
        installed in the sandbox (should be a fairly clean 3.0

        While compiling devel/autogen I see ...

mkdir .libs
cc -std=gnu99 -O2 
-Wl,-R/usr/pkg/lib -o .libs/getdefs gd.o  
../autoopts/.libs/ -lm  -Wl,--rpath -Wl,/usr/pkg/lib
creating getdefs
gmake[4]: Leaving directory 
./bootstrap.dir: 43: Syntax error: word unexpected (expecting ")")
gmake[3]: *** [stamp-man] Error 2
gmake[3]: Leaving directory 
gmake[2]: *** [all-recursive] Error 1
gmake[2]: Leaving directory 
gmake[1]: *** [all-recursive] Error 1
gmake[1]: Leaving directory 
gmake: *** [all] Error 2
*** Error code 2



Home | Main Index | Thread Index | Old Index