Subject: pkg/35994: security/putty gcc412 solaris10 -m64
To: None <,,>
From: Gilles Dauphin <>
List: pkgsrc-bugs
Date: 03/13/2007 09:30:01
>Number:         35994
>Category:       pkg
>Synopsis:       security/putty gcc412 solaris10 -m64
>Confidential:   no
>Severity:       non-critical
>Priority:       low
>Responsible:    pkg-manager
>State:          open
>Class:          sw-bug
>Submitter-Id:   net
>Arrival-Date:   Tue Mar 13 09:30:01 +0000 2007
>Originator:     Gilles Dauphin
>Release:        SunOS 5.10 i86pc

System: SunOS 5.10 Generic_118855-19 i86pc


gcc   -g -DHAVE_NO_SETRESUID -I/usr/pkg/include -I/usr/include -Wall -Werror -I.
././ -I../charset/ -I../windows/ -I../unix/ -I../mac/ -I../macosx/ `gtk-config -
-cflags` -c ../unix/uxnet.c
../unix/uxnet.c: In function 'net_select_result':
../unix/uxnet.c:1093: error: 'SIOCATMARK' undeclared (first use in this function
../unix/uxnet.c:1093: error: (Each undeclared identifier is reported only once
../unix/uxnet.c:1093: error: for each function it appears in.)

[] note: The real command line, after the pkgsrc wrapper, was:
/pkg/obj/security/putty/work/.gcc/bin/gcc -g -DHAVE_NO_SETRESUID -I/pkg/obj/secu
rity/putty/work/.buildlink/include -Wall -Werror -I.././ -I../charset/ -I../wind
ows/ -I../unix/ -I../mac/ -I../macosx/ -I/pkg/obj/security/putty/work/.buildlink
/include/gtk-1.2 -I/pkg/obj/security/putty/work/.buildlink/include/glib/glib-1.2
 -I/pkg/obj/security/putty/work/.buildlink/lib/glib/include -I/pkg/obj/security/
putty/work/.x11-buildlink/include -c ../unix/uxnet.c -m64 -L/pkg/obj/security/pu
gmake: *** [uxnet.o] Error 1
*** Error code 2