Subject: pkg/35425: lang/drscheme fails compilation under -current
To: None <,,>
From: None <>
List: pkgsrc-bugs
Date: 01/15/2007 14:30:00
>Number:         35425
>Category:       pkg
>Synopsis:       lang/drscheme fails compilation under -current
>Confidential:   no
>Severity:       serious
>Priority:       medium
>Responsible:    pkg-manager
>State:          open
>Class:          sw-bug
>Submitter-Id:   net
>Arrival-Date:   Mon Jan 15 14:30:00 +0000 2007
>Originator:     Chavdar Ivanov
>Release:        4.99.8
Delcam UK
uname -a                                                      /usr/pkgsrc/lang/drscheme
NetBSD loan8 4.99.8 NetBSD 4.99.8 (GENERIC.MPACPI) #1: Thu Jan 11 17:12:25 GMT 2007  root@loan8:/e/obj1/netbsd-builds/4_99/i386/obj/sys/arch/i386/compile/GENERIC.MPACPI i386
c++  -I/usr/X11R6/include -I./../../mzscheme/gc -I./../../wxxt/src/AIAI-include -I./../../wxxt/src -I./../../mred/wxme/ -I./../../mzscheme/include/ -DOPERATOR_NEW_ARRAY -Dwx_xt   -O2 -I/usr/pkg/include -DGLX_GLXEXT_LEGACY -I/usr/pkg/include/freetype2 -I/usr/include -I/usr/pkg/include -DGLX_GLXEXT_LEGACY -I/usr/pkg/include/freetype2 -I/usr/include   -c ./wxs_madm.cxx -o wxs_madm.o
./../../mred/wxme/wx_madm.h:68: error: ISO C++ forbids declaration of 'wxUpdateCursorTimer' with no type
./../../mred/wxme/wx_madm.h:68: error: expected ';' before '*' token

[] note: The real command line, after the pkgsrc wrapper, was:
/usr/pkgsrc/lang/drscheme/work/.gcc/bin/g++ -I/usr/pkgsrc/lang/drscheme/work/.x11-buildlink/include -I./../../mzscheme/gc -I./../../wxxt/src/AIAI-include -I./../../wxxt/src -I./../../mred/wxme/ -I./../../mzscheme/include/ -DOPERATOR_NEW_ARRAY -Dwx_xt -O2 -I/usr/pkgsrc/lang/drscheme/work/.buildlink/include -DGLX_GLXEXT_LEGACY -I/usr/pkgsrc/lang/drscheme/work/.buildlink/include/freetype2 -c ./wxs_madm.cxx -o wxs_madm.o -L/usr/pkgsrc/lang/drscheme/work/.buildlink/lib 
gmake[3]: *** [wxs_madm.o] Error 1
gmake[3]: Leaving directory `/usr/pkgsrc/lang/drscheme/work/plt/src/mred/wxs'
gmake[2]: *** [all] Error 2
gmake[2]: Leaving directory `/usr/pkgsrc/lang/drscheme/work/plt/src/mred'
gmake[1]: *** [mr] Error 2
gmake[1]: Leaving directory `/usr/pkgsrc/lang/drscheme/work/plt/src'
gmake: *** [all] Error 2
*** Error code 2

make: stopped in /usr/pkgsrc/lang/drscheme
*** Error code 1

make: stopped in /usr/pkgsrc/lang/drscheme

just make in lang/drscheme; pkgsrc is also current. Tested on two different machines (once with no /etc/mk.conf). 

(This maybe a duplicate entry; the first send-pr attempt failed apparently due to graylisting).