Subject: Re: pkg/31407
To: None <,,,>
From: None <>
List: pkgsrc-bugs
Date: 09/28/2005 14:42:06
Synopsis: x11/kdebase3 fails to build due to import of qt-3.3.5

State-Changed-From-To: closed->open
State-Changed-When: Wed, 28 Sep 2005 14:42:05 +0000
It turns out that the "kdebase3" package is not the only package affected
by this QT problem:

===> Checking for vulnerabilities in kdepim-3.4.2nb1
===> Building for kdepim-3.4.2nb1
/usr/pkg/bin/gmake  all-recursive
gmake[3]: Entering directory `/src/NetBSD-current/pkgsrc/misc/kdepim3/work/kdepim-3.4.2/korn'
if c++ -DHAVE_CONFIG_H -I. -I. -I.. -I../libkdepim -I/usr/pkg/include -I/usr/pkg/qt3/include -I/usr/X11R6/include  -I/usr/pkg/include -I/usr/X11R6/include  -DQT_THREAD_SUPPORT -I/usr/pkg/include -I/usr/include -I/usr/pkg/qt3/include -DGLX_GLXEXT_LEGACY -I/usr/pkg/include/freetype2 -I/usr/X11R6/include -I/usr/include/krb5  -Wnon-virtual-dtor -Wno-long-long -Wundef -Wall -W -Wpointer-arith -Wno-non-virtual-dtor -DNDEBUG -DNO_DEBUG -O2 -O2 -I/usr/pkg/include -I/usr/include -I/usr/pkg/qt3/include -DGLX_GLXEXT_LEGACY -I/usr/pkg/include/freetype2 -I/usr/X11R6/include -I/usr/include/krb5 -fno-exceptions -fno-check-new -fno-common -DQT_CLEAN_NAMESPACE -DQT_NO_ASCII_CAST -DQT_NO_STL -DQT_NO_COMPAT -DQT_NO_TRANSLATION  -MT kornboxcfg.o -MD -MP -MF ".deps/kornboxcfg.Tpo" -c -o kornboxcfg.o kornboxcfg.cpp; \
then mv -f ".deps/kornboxcfg.Tpo" ".deps/kornboxcfg.Po"; else rm -f ".deps/kornboxcfg.Tpo"; exit 1; fi
kornboxcfg.cpp:31:33: keditlistboxmanager.h: No such file or directory
gmake[3]: *** [kornboxcfg.o] Error 1
gmake[3]: Leaving directory `/src/NetBSD-current/pkgsrc/misc/kdepim3/work/kdepim-3.4.2/korn'
gmake[2]: *** [all-recursive] Error 1
gmake[2]: Leaving directory `/src/NetBSD-current/pkgsrc/misc/kdepim3/work/kdepim-3.4.2/korn'
gmake[1]: *** [all-recursive] Error 1
gmake[1]: Leaving directory `/src/NetBSD-current/pkgsrc/misc/kdepim3/work/kdepim-3.4.2'
gmake: *** [all] Error 2
*** Error code 2

make: stopped in /src/NetBSD-current/pkgsrc/misc/kdepim3
===> There was an error during the ``build'' phase.
===> Please investigate the following for more information:
===>      * log of the build
===>      * /src/NetBSD-current/pkgsrc/misc/kdepim3/work/.work.log
*** Error code 1

make: stopped in /src/NetBSD-current/pkgsrc/misc/kdepim3