NetBSD-Bugs archive

[Date Prev][Date Next][Thread Prev][Thread Next][Date Index][Thread Index][Old Index]

misc/48106: makefs build failure w/ latest -current, amd64

>Number:         48106
>Category:       misc
>Synopsis:       makefs build failure w/ latest -current, amd64
>Confidential:   no
>Severity:       non-critical
>Priority:       medium
>Responsible:    misc-bug-people
>State:          open
>Class:          sw-bug
>Submitter-Id:   net
>Arrival-Date:   Tue Aug 06 19:10:00 +0000 2013
>Originator:     brad harder
>Release:        -current, amd64
method logic digital
NetBSD kamloops 6.99.23 NetBSD 6.99.23 (GENERIC) #275: Tue Aug  6 11:38:29 PDT 
2013  root@kamloops:/usr/obj/sys/arch/amd64/compile/GENERIC amd64
#      link  makefs/makefs
cc -O -I. -I/usr/src/obj/tooldir.NetBSD-6.99.23-amd64/include/nbinclude 
64/include/nbinclude -I/usr/src/obj/tooldir.NetBSD-6.99.23-amd64/include/compat 
-I/usr/src/tools/compat -DHAVE_NBTOOL_CONFIG_H=1 -D_FILE_OFFSET_BITS=64 
ols/makefs/../../usr.sbin/makefs -I/usr/src/sbin/mknod 
-I/usr/src/usr.sbin/mtree -DMAKEFS -I/usr/src/sys/fs/cd9660 
-I/usr/src/sys/ufs/chfs -DV7FS_EI -I/usr/src/sys/f
s/v7fs -I/usr/src/sbin/newfs_v7fs -I/usr/src/sbin/fsck -DMSDOS_EI 
-I/usr/src/sys/fs/msdosfs -I/usr/src/sbin/newfs_msdos -I/usr/src/sys/fs/udf 
df -I/usr/src/sbin/fsck   -o makefs cd9660.lo chfs.lo ffs.lo v7fs.lo msdos.lo 
udf.lo getid.lo makefs.lo misc.lo pack_dev.lo spec.lo walk.lo cd9660_strings.lo 
debug.lo cd9660_eltorito.lo cd9660_write.lo cd9660_conversion.lo 
iso9660_rrip.lo cd9660_archimedes.lo chfs_mkfs.lo ffs_alloc.lo ffs_balloc.lo 
ffs_bswap.lo ffs_subr.l
o ffs_tables.lo ufs_bmap.lo buf.lo mkfs.lo v7fs_endian.lo v7fs_superblock.lo 
v7fs_superblock_util.lo v7fs_inode.lo v7fs_inode_util.lo v7fs_datablock.lo 
o v7fs_io.lo v7fs_file.lo v7fs_file_util.lo v7fs_io_user.lo main.lo 
v7fs_estimate.lo v7fs_populate.lo mkfs_msdos.lo msdosfs_fat.lo msdosfs_conv.lo 
msdosfs_lookup.lo msdosfs_denode.lo msdosfs_vnops.lo udf_create.lo udf_write.lo 
udf_osta.lo -L/usr/src/obj/tooldir.NetBSD-6.99.23-amd64/lib -lnbcompat -lz
udf.lo: In function `udf_makefs':
udf.c:(.text+0x1ded): undefined reference to `snprintb'
*** [makefs] Error code 1
nbmake[6]: stopped in /usr/src/tools/makefs
1 error
nbmake[6]: stopped in /usr/src/tools/makefs
*** [dependall] Error code 2
nbmake[5]: stopped in /usr/src/tools/makefs
1 error
nbmake[5]: stopped in /usr/src/tools/makefs
*** Failed target:  dependall-makefs
*** Failed command: _makedirtarget() { dir="$1"; shift; target="$1"; shift; 
case "${dir}" in /*) this="${dir}/"; real="${dir}" ;; .) this="tools/"; 
ols" ;; *) this="tools/${dir}/"; real="/usr/src/tools/${dir}" ;; esac; 
show=${this:-.}; echo "${target} ===> ${show%/}${1:+ (with: $@)}"; cd "${real}" 
&& /usr/src/ob
j/tooldir.NetBSD-6.99.23-amd64/bin/nbmake _THISDIR_="${this}" "$@" ${target}; 
}; _makedirtarget makefs dependall
*** Error code 2
nbmake[4]: stopped in /usr/src/tools
*** [build_install] Error code 1
nbmake[3]: stopped in /usr/src/tools
1 error
nbmake[3]: stopped in /usr/src/tools
*** [do-tools] Error code 2
nbmake[2]: stopped in /usr/src
1 error
nbmake[2]: stopped in /usr/src
*** [build] Error code 2

nbmake[1]: stopped in /usr/src
1 error

nbmake[1]: stopped in /usr/src
*** [distribution] Error code 2

nbmake: stopped in /usr/src
1 error

nbmake: stopped in /usr/src

ERROR: Failed to make distribution

cd /usr/src; ./ -j4 -u -x distribution


/usr/src/usr.sbin/makefs/udf/ link to libutil, define LIBUTIL 
(/usr/src/usr.sbin/makefs/Makefile) ? 

Home | Main Index | Thread Index | Old Index