Subject: pkg/24831: devel/atk fails to build
To: None <>
From: None <>
List: netbsd-bugs
Date: 03/17/2004 20:12:03
>Number:         24831
>Category:       pkg
>Synopsis:       devel/atk fails to build
>Confidential:   no
>Severity:       serious
>Priority:       medium
>Responsible:    pkg-manager
>State:          open
>Class:          sw-bug
>Submitter-Id:   net
>Arrival-Date:   Wed Mar 17 20:13:00 UTC 2004
>Originator:     Bill Warner
>Release:        1.61
NetBSD 1.6.1 NetBSD 1.6.1 (GENERIC_LAPTOP) #0: Tue Apr  8 12:21:37 UTC 2003 i386
Build of devel/atk proceeds normally until:

/bin/sh ../libtool --mode=link gcc  -O2 -I/usr/pkg/include -I/usr/include -Wall  -L/usr/pkg/lib -Wl,-R/usr/pkg/lib -L/usr/lib -Wl,-R/usr/lib -o -rpath /usr/pkg/lib -version-info 400:1:400  atkaction.lo atkcomponent.lo atkdocument.lo atkeditabletext.lo atkgobjectaccessible.lo atkhyperlink.lo atkhypertext.lo atkimage.lo atknoopobject.lo atknoopobjectfactory.lo atkobject.lo atkobjectfactory.lo atkregistry.lo atkrelation.lo atkrelationset.lo atkselection.lo atkstate.lo atkstateset.lo atkstreamablecontent.lo atktable.lo atktext.lo atkutil.lo atkvalue.lo atk-enum-types.lo -Wl,-R/usr/pkg/lib -Wl,--export-dynamic -L/usr/pkg/lib -lgobject-2.0 -lgmodule-2.0 -lglib-2.0 -lintl -liconv -lm    -lintl
grep: /usr/pkgsrc/devel/atk/work/.buildlink/lib/ No such file or directory
sed: /usr/pkgsrc/devel/atk/work/.buildlink/lib/ No such file or directory
libtool: link: `/usr/pkgsrc/devel/atk/work/.buildlink/lib/' is not a valid libtool archive
gmake[3]: *** [] Error 1
gmake[3]: Leaving directory `/usr/pkgsrc/devel/atk/work/atk-1.4.1/atk'
gmake[2]: *** [all] Error 2
gmake[2]: Leaving directory `/usr/pkgsrc/devel/atk/work/atk-1.4.1/atk'
gmake[1]: *** [all-recursive] Error 1
gmake[1]: Leaving directory `/usr/pkgsrc/devel/atk/work/atk-1.4.1'
gmake: *** [all] Error 2
*** Error code 2

make: stopped in /usr/pkgsrc/devel/atk
*** Error code 1

make: stopped in /usr/pkgsrc/devel/atk
cd /usr/pkgsrc/devel/atk