Subject: pkg/24150: galeon won't build
To: None <>
From: None <>
List: netbsd-bugs
Date: 01/19/2004 08:15:00
>Number:         24150
>Category:       pkg
>Synopsis:       galeon won't build on -current
>Confidential:   no
>Severity:       serious
>Priority:       high
>Responsible:    pkg-manager
>State:          open
>Class:          sw-bug
>Submitter-Id:   net
>Arrival-Date:   Mon Jan 19 13:16:00 UTC 2004
>Originator:     Steven M. Bellovin
>Release:        NetBSD 1.6ZH
AT&T Labs
System: NetBSD 1.6ZH NetBSD 1.6ZH (CHALLENGER) #0: Fri Jan 16 14:51:00 EST 2004 i386
Architecture: i386
Machine: i386
	Galeon doesn't compile
	In file included from ../../src/galeon.h:30,
			 from mozilla.cpp:19:
	 ../../config.h:14:1: warning: "MOZILLA_VERSION" redefined
	 In file included from <command line>:11:
	 /usr/pkg/include/mozilla/mozilla-config.h:44:1: warning: this is the location of
	  the previous definition
	  mozilla.cpp:89:30: nsCCookieManager.h: No such file or directory
	  gmake[4]: *** [mozilla.o] Error 1
	  gmake[4]: Leaving directory `/usr/pkgsrc/www/galeon/work/galeon-1.2.13/src/mozil
	  gmake[3]: *** [all-recursive] Error 1
	  gmake[3]: Leaving directory `/usr/pkgsrc/www/galeon/work/galeon-1.2.13/src'
	  gmake[2]: *** [all] Error 2
	  gmake[2]: Leaving directory `/usr/pkgsrc/www/galeon/work/galeon-1.2.13/src'
	  gmake[1]: *** [all-recursive] Error 1
	  gmake[1]: Leaving directory `/usr/pkgsrc/www/galeon/work/galeon-1.2.13'
	  gmake: *** [all] Error 2
	  *** Error code 2
	  make: stopped in /usr/pkgsrc/www/galeon
	  *** Error code 1
	  make: stopped in /usr/pkgsrc/www/galeon