Subject: current build failure - ktruss/dump.c
To: None <>
From: Chris Tribo <>
List: current-users
Date: 11/18/2003 21:35:02
#   compile  dump.o
/m/current/tools//bin/i386--netbsdelf-gcc -O2 -march=pentium3  -Wall 
-Wstrict-prototypes -Wmissing-prototypes -Wpointer-arith -Wno-sign-compare 
-Wno-traditional -Wno-uninitialized  -Werror   -I. -I/m/src/usr.bin/ktrace 
-I/m/src/sys  -I/m/src/usr.bin/kdump -DKTRUSS  -nostdinc -isystem 
/m/current/dest//usr/include  -c    /m/src/usr.bin/ktruss/dump.c
/m/src/usr.bin/ktruss/dump.c: In function `ktrsyscall':
/m/src/usr.bin/ktruss/dump.c:299: error: `current' undeclared (first use 
in this function)
/m/src/usr.bin/ktruss/dump.c:299: error: (Each undeclared identifier is 
reported only once
/m/src/usr.bin/ktruss/dump.c:299: error: for each function it appears in.)

*** Failed target:  dump.o
*** Failed command: /m/current/tools//bin/i386--netbsdelf-gcc -O2 
-march=pentium3 -Wall -Wstrict-prototypes -Wmissing-prototypes 
-Wpointer-arith -Wno-sign-compare -Wno-traditional -Wno-uninitialized 
-Werror -I. -I/m/src/usr.bin/ktrace -I/m/src/sys -I/m/src/usr.bin/kdump 
-DKTRUSS -nostdinc -isystem /m/current/dest//usr/include -c 

Stale depends and cruft in my build tree or is anyone else seeing this?


The nice thing about Windows is - It does not just crash, it displays a
dialog box and lets you press 'OK' first.
						-- Arno Schaefer