Subject: Re: KDElibs2 build fails
To: None <>
From: Ulrich Habel <>
List: current-users
Date: 01/06/2002 02:20:11 writes:
 > you probably need to increase the process datasize.
 > for csh/tcsh;
 >    unlimit datasize
 yep ...that did the trick ! but it fails later with the following
 Well I think its not that important to have a discussion here about
 KDE or any other environment. Does someone have the same problem ?
 /usr/include/g++/stl_construct.h:78:   instantiated from `destroy<Arts::ModuleDe
 f *>(Arts::ModuleDef *, Arts::ModuleDef *)'
 /usr/include/g++/stl_vector.h:266:   instantiated from `vector<Arts::ModuleDef,a
 llocator<Arts::ModuleDef> >::~vector()'   instantiated from here
 /usr/include/g++/stl_construct.h:78: confused by earlier errors, bailing out
 gmake[3]: *** [soundserverv2_impl.o] Error 1
 gmake[3]: Leaving directory `/usr/src/pkgsrc/x11/kdelibs2/work/kdelibs-2.2.2/art
 gmake[2]: *** [all-recursive] Error 1
 gmake[2]: Leaving directory `/usr/src/pkgsrc/x11/kdelibs2/work/kdelibs-2.2.2/art
 gmake[1]: *** [all-recursive] Error 1
 gmake[1]: Leaving directory `/usr/src/pkgsrc/x11/kdelibs2/work/kdelibs-2.2.2'
 gmake: *** [all-recursive-am] Error 2
 *** Error code 2

Ulrich Habel		:wq! 
-= Java : written once - debug everywhere =-