Subject: Re: out of virtual memory
To: Murray Armfield <>
From: Nigel Reed <>
List: current-users
Date: 11/01/2001 17:26:56
I had that problem too. Try running unlimit in the csh and try again.


On Fri, Nov 02, 2001 at 10:21:42AM +1100, Murray Armfield wrote:
> Hi Folks,
> 	Just wondering if anyone can shed any light on whats happening to my mac=
hine. Its i386 running current as of 1/11/01. When I enter vi I get lots of:
> 	vi in free(): warning: junk pointer, too high to make sense.
> and when I try to freshly rebuild pkgsrc just for kde I get this error in=
 building kdelibs2:
> gmake[2]: Entering directory `/disks/ld0/cvshome/pkgsrc/x11/kdelibs2/work=
> Making all in misc
> gmake[3]: Entering directory `/disks/ld0/cvshome/pkgsrc/x11/kdelibs2/work=
> /bin/sh ../../libtool --mode=3Dcompile --tag=3DCXX c++ -DHAVE_CONFIG_H -I=
. -I. -I../.. -I../../kimgio -I../.. -I../../dcop  -I../../kio -I../../libl=
tdl  -I../../khtml -I../../khtml/misc -I../../khtml/css  -I../../khtml/dom =
-I../../khtml/xml -I../../khtml/html  -I../../dcop -I../../libltdl -I../../=
kdecore -I../../kdeui -I../../kssl -I/disks/ld0/cvshome/pkgsrc/x11/kdelibs2=
/work/.buildlink/qt2/include -I/usr/X11R6/include  -I/disks/ld0/cvshome/pkg=
src/x11/kdelibs2/work/.buildlink/include  -I/disks/ld0/cvshome/pkgsrc/x11/k=
delibs2/work/.buildlink/include -I/disks/ld0/cvshome/pkgsrc/x11/kdelibs2/wo=
rk/.buildlink/include  -I/disks/ld0/cvshome/pkgsrc/x11/kdelibs2/work/.build=
link/include  -O2 -I/disks/ld0/cvshome/pkgsrc/x11/kdelibs2/work/.buildlink/=
include -I/disks/ld0/cvshome/pkgsrc/x11/kdelibs2/work/.buildlink/include -I=
/disks/ld0/cvshome/pkgsrc/x11/kdelibs2/work/.buildlink/include -O2 -fno-exc=
eptions -fno-check-new  -ftemplate-depth-99 -DQT_NO_TRANSLATION -DQT_CLEAN_=
> MPAT -DQT_NO_ASCII_CAST  -c helper.cpp
> c++ -DHAVE_CONFIG_H -I. -I. -I../.. -I../../kimgio -I../.. -I../../dcop -=
I../../kio -I../../libltdl -I../../khtml -I../../khtml/misc -I../../khtml/c=
ss -I../../khtml/dom -I../../khtml/xml -I../../khtml/html -I../../dcop -I..=
/../libltdl -I../../kdecore -I../../kdeui -I../../kssl -I/disks/ld0/cvshome=
/pkgsrc/x11/kdelibs2/work/.buildlink/qt2/include -I/usr/X11R6/include -I/di=
sks/ld0/cvshome/pkgsrc/x11/kdelibs2/work/.buildlink/include -I/disks/ld0/cv=
shome/pkgsrc/x11/kdelibs2/work/.buildlink/include -I/disks/ld0/cvshome/pkgs=
rc/x11/kdelibs2/work/.buildlink/include -I/disks/ld0/cvshome/pkgsrc/x11/kde=
libs2/work/.buildlink/include -O2 -I/disks/ld0/cvshome/pkgsrc/x11/kdelibs2/=
work/.buildlink/include -I/disks/ld0/cvshome/pkgsrc/x11/kdelibs2/work/.buil=
dlink/include -I/disks/ld0/cvshome/pkgsrc/x11/kdelibs2/work/.buildlink/incl=
ude -O2 -fno-exceptions -fno-check-new -ftemplate-depth-99 -DQT_NO_TRANSLAT=
fPIC -DPIC -o .l!
> ibs/helper.o
> helper.cpp: In method `HTMLColors::HTMLColors()':
> helper.cpp:156: virtual memory exhausted
> gmake[3]: *** [helper.lo] Error 1
> gmake[3]: Leaving directory `/disks/ld0/cvshome/pkgsrc/x11/kdelibs2/work/=
> gmake[2]: *** [all-recursive] Error 1
> gmake[2]: Leaving directory `/disks/ld0/cvshome/pkgsrc/x11/kdelibs2/work/=
> gmake[1]: *** [all-recursive] Error 1
> gmake[1]: Leaving directory `/disks/ld0/cvshome/pkgsrc/x11/kdelibs2/work/=
> gmake: *** [all-recursive-am] Error 2
> *** Error code 2
> Stop.
> make: stopped in /disks/ld0/cvshome/pkgsrc/x11/kdelibs2
> *** Error code 1
> Stop.
> make: stopped in /disks/ld0/cvshome/pkgsrc/x11/kdelibs2
> *** Error code 1
> Stop.
> make: stopped in /disks/ld0/cvshome/pkgsrc/x11/kdelibs2
> Can anyone shed any light on my prob?
> Regards,
> 	Murray Armfield