pkgsrc-Bugs archive

[Date Prev][Date Next][Thread Prev][Thread Next][Date Index][Thread Index][Old Index]

pkg/34580: fonts/fontforge Solaris10



>Number:         34580
>Category:       pkg
>Synopsis:       fonts/fontforge Solaris10
>Confidential:   no
>Severity:       serious
>Priority:       medium
>Responsible:    pkg-manager
>State:          open
>Class:          sw-bug
>Submitter-Id:   net
>Arrival-Date:   Thu Sep 21 14:40:00 +0000 2006
>Originator:     Gilles Dauphin
>Release:        SunOS 5.10 i86pc
>Organization:
ENST 
>Environment:


System: SunOS bi.enst.fr 5.10 Generic_Patch_118844-30 i86pc


>Description:


gmake[1]: Entering directory 
`/pkg/obj/fonts/fontforge/work/fontforge-20060822/fontforge'
gcc -O -I/usr/pkg/include -I/usr/pkg/include/freetype2 -I/usr/include 
-I/usr/pkg/include/freetype2/ -I/usr/include/libxml2/ -I../inc -I. -I. 
-Wmissing-prototypes -Wunused -Wimplicit -Wreturn-type -Wparentheses -Wformat 
-Wchar-subscripts -I/usr/openwin/include -DPACKAGE_NAME=\"\" 
-DPACKAGE_TARNAME=\"\" -DPACKAGE_VERSION=\"\" -DPACKAGE_STRING=\"\" 
-DPACKAGE_BUGREPORT=\"\" -DSTDC_HEADERS=1 -DHAVE_SYS_TYPES_H=1 
-DHAVE_SYS_STAT_H=1 -DHAVE_STDLIB_H=1 -DHAVE_STRING_H=1 -DHAVE_MEMORY_H=1 
-DHAVE_STRINGS_H=1 -DHAVE_INTTYPES_H=1 -DHAVE_STDINT_H=1 -DHAVE_UNISTD_H=1 
-DHAVE_DLFCN_H=1 -DHAVE_ICONV_H=1 -DHAVE_IEEEFP_H=1 -DHAVE_STDINT_H=1 
-D_NO_XKB=1 -DHAVE_LONG_DOUBLE=1 -D_HAS_LONGLONG=1 -DHAVE_LIBINTL_H=1 
-DFONTFORGE_CONFIG_DEVICETABLES=1  '-DSHAREDIR="/usr/pkg/share/fontforge"' 
-DLIBDIR='"/usr/pkg/lib"' -DPNG_NO_ASSEMBLER_CODE -I/usr/pkg/include 
-I/usr/pkg/include/freetype2 -I/usr/include '-DPREFIX="/usr/pkg"' 
-DPNG_NO_ASSEMBLER_CODE -I/usr/pkg/include -I/usr/pkg/include/freetype2 -I/usr/i
 nclude  -c -o autohint.o autohint.c
In file included from 
/usr_ro/sfw/bin/../lib/gcc/i386-pc-solaris2.10/3.4.3/include/math.h:332,
                 from autohint.c:29:
/usr/include/floatingpoint.h:72: error: syntax error before '[' token
gmake[1]: *** [autohint.o] Error 1
gmake[1]: Leaving directory 
`/pkg/obj/fonts/fontforge/work/fontforge-20060822/fontforge'
gmake: *** [fontforge] Error 2



>How-To-Repeat:


bmake


>Fix:


I am working on.





Home | Main Index | Thread Index | Old Index